{"text_format":"1","workbook":"xlsx","n_sheets":18,"sheets":["Lists","START","Cover sheet","Contents","1 Benchmarking data","2 Financial health","2b Ratios","3 SOCI","4 BS","5 Cashflow","3a Income","3b ESFA income","3c Other agency income","3d Staff costs","3e Non-pay costs","3f Miscellaneous","List of colleges","List of auditors"],"not_rendered":{"charts":0,"images":3,"macros":0,"external_links":1,"defined_names":26,"comments":2,"pivot_tables":0},"unopened":[],"bounds":{"document_bytes":16777216,"sheet_cells":100000,"rows_first":2000,"rows_last":500,"rows_between":2000,"halvings":0,"cell_chars":16384,"cell_head_chars":4096},"cells_cut":0,"cells_raw":0,"read":"whole","date_system":"1900"}

{"sheet":"Lists","index":0,"n_rows":336,"n_cols":8,"rows_kept":336,"cut":false,"hidden":true,"merged":[]}
["College Name","College Type","College Code","College UPIN","College Region","Responsible Funding Body",null,"Yes/No Lists"]
["Abingdon and Witney College","GFEC","ABING",112314,"SE","SFA",null,"SELECT FROM LIST"]
["Accrington and Rossendale College","TC","ACCRO",106762,"NW","SFA",null,"Yes"]
["Activate Learning","GFEC","OXFFE",116105,"SE","SFA",null,"No"]
["Alton College","SFC","ALTON",108469,"SE","EFA"]
["Amersham and Wycombe College","GFEC","AMWYC",105019,"SE","SFA",null,"Return Statement"]
["Aquinas College","SFC","AQUIN",108372,"NW","EFA",null,"This cover sheet must be completed in respect of all returns. Please complete and return it with the financial plan and commentary to the EFA by 31 July 2015."]
["Ashton-Under-Lyne Sixth Form College","SFC","ASHTN",108439,"NW","EFA",null,"This cover sheet must be completed in respect of all returns. Please complete and return it with the financial plan and commentary to the Skills Funding Agency by 31 July 2015."]
["Askham Bryan College","A&HC","ASKBR",105948,"YH","SFA"]
["Aylesbury College","GFEC","AYLES",108983,"SE","SFA",null,"Electronic Submission"]
["Barking and Dagenham College","GFEC","BARKG",106542,"GL","SFA",null,"Electronic copies of this financial plan have been emailed to externalassurance.EFA@education.gsi.gov.uk"]
["Barnet  and Southgate College","GFEC","BARNT",108532,"GL","SFA",null,"Electronic copies of this financial plan have been emailed to pfm@skillsfundingagency.bis.gov.uk"]
["Barnfield College","GFEC","BARFI",105000,"EE","SFA"]
["Barnsley College","TC","BNSLY",107013,"YH","SFA"]
["Barrow-in-Furness Sixth Form College","SFC","BAROF",108438,"NW","EFA"]
{"$rows_left_out":322}
{"sheet":"START","index":1,"n_rows":3,"n_cols":21,"rows_kept":3,"cut":false,"hidden":true,"merged":[[2,1,2,17]]}
[]
[]
[null,"YOU MUST ENABLE MACROS IN ORDER TO USE THIS TEMPLATE",null,null,null,null,null,null,null,null,null,null,null,null,null,null,null,null,null,null,"KPMGA0C15"]

{"sheet":"Cover sheet","index":2,"n_rows":43,"n_cols":9,"rows_kept":43,"cut":false,"hidden":false,"merged":[[32,3,32,4],[32,5,32,6],[32,7,32,8],[17,2,17,7],[27,3,27,8],[29,7,29,8],[31,3,31,8],[29,5,29,6],[29,3,29,4],[21,2,21,7],[25,2,25,7],[4,3,4,8],[15,2,15,7],[13,4,13,6],[12,4,12,6],[23,2,23,7],[19,2,19,7]]}
[null,null,null,null,null,null,null,null,"Version 1.0"]
[null,"Cover sheet and Principal's statement"]
[]
[]
[null,"College name:"]
[]
[null,1,"College type",{"$f":"IF(D5=\"\", \"SELECT COLLEGE\",VLOOKUP(D5,CollegeDetails,2,FALSE))","v":"SELECT COLLEGE"},null,null,2,"College code",{"$f":"IF(D5=\"\", \"SELECT COLLEGE\",VLOOKUP(D5,CollegeDetails,3,FALSE))","v":"SELECT COLLEGE"}]
[]
[null,3,"College UPIN",{"$f":"IF(D5=\"\", \"SELECT COLLEGE\",VLOOKUP(D5,CollegeDetails,4,FALSE))","v":"SELECT COLLEGE"}]
[]
[null,4,"Financial health grade"]
[]
[null,null,"Year ending 31 July","Automated","College self-assessment"]
[null,null,"2017",{"$f":"IF('2 Financial health'!G19=\"Inadequate\",'2 Financial health'!G19,IF('2 Financial health'!G19=\"Satisfactory\",'2 Financial health'!G19,IF('2 Financial health'!G19=\"Good\",'2 Financial health'!G19,IF('2 Financial health'!G19=\"Outstanding\",'2 Financial health'!G19,\"Complete schedules 1-5\"))))","v":"Complete schedules 1-5"},{"$f":"IF('2 Financial health'!G23=\"SELECT FROM LIST\",\"Complete schedules 1-5\",'2 Financial health'!G23)","v":"Complete schedules 1-5"},{"$f":"IF(#REF!=\"Please enter\",\"Complete schedules 1-4\",#REF!)","v":{"$error":"#REF!"}},{"$f":"IF(#REF!=\"Please enter\",\"Complete schedules 1-4\",#REF!)","v":{"$error":"#REF!"}}]
[]
{"$rows_left_out":29}
{"sheet":"Contents","index":3,"n_rows":36,"n_cols":4,"rows_kept":36,"cut":false,"hidden":false,"merged":[[29,2,29,3],[30,2,30,3],[31,2,31,3],[32,2,32,3]]}
[null,{"$f":"IF('Cover sheet'!D5=\"\",\"\",'Cover sheet'!D5)","v":""}]
[null,"Contents"]
[]
[]
[null,null,"Schedule 1","Benchmarking data"]
[]
[null,null,"Schedule 2","Financial health grade"]
[]
[null,null,"Schedule 2b","Ratio analysis"]
[]
[null,null,"Schedule 3","Statement of comprehensive income"]
[]
[null,null,"Schedule 4","Balance sheet"]
[]
[null,null,"Schedule 5","Statement of cash flows"]
{"$rows_left_out":22}
{"sheet":"1 Benchmarking data","index":4,"n_rows":268,"n_cols":9,"rows_kept":268,"cut":false,"hidden":false,"merged":[[75,2,75,4],[52,2,52,4],[46,2,46,5],[24,2,24,3],[25,2,25,3],[27,2,27,3],[28,2,28,3],[43,2,43,3],[38,2,38,3],[39,2,39,3],[88,2,88,5],[71,2,71,5],[72,2,72,5],[54,2,54,5],[55,2,55,5],[56,2,56,5],[67,2,67,5],[60,2,60,4],[61,2,61,4],[64,2,64,4],[70,2,70,5],[83,2,83,4],[85,2,85,3],[87,2,87,5],[66,2,66,3],[86,2,86,5],[2,1,2,6],[34,2,34,3],[35,2,35,3],[36,2,36,3],[37,2,37,3],[17,2,17,5],[18,2,18,5],[16,2,16,5],[7,2,7,4],[8,2,8,4],[13,2,13,4],[82,2,82,4],[79,2,79,4],[4,2,4,4],[5,2,5,4],[14,2,14,4],[6,2,6,4],[10,2,10,4],[29,2,29,3],[30,2,30,3],[33,2,33,3],[11,2,11,4],[41,2,41,3],[31,2,31,3],[22,2,22,5],[49,2,49,4],[76,2,76,4],[94,2,94,5],[95,2,95,5],[96,2,96,5],[97,2,97,5],[91,2,91,5]]}
[null,{"$f":"Contents!B1","v":""}]
[null,"Schedule 1: Benchmarking data"]
[]
[null,1,"Learners"]
[null,null,"ESFA funded learners",null,null,"Number","Average dedicated funding per learner\n£"]
[null,"1a","Youth (16-18): non-apprenticeship",null,null,null,{"$f":"IFERROR(('3b ESFA income'!G7)/'1 Benchmarking data'!F6*1000,0)","v":0},null,{"$f":"IF(F6=\"\",1,0)","v":1}]
[null,"1b","Youth (16-18): apprenticeship",null,null,null,{"$f":"IFERROR(('3b ESFA income'!G18+'3b ESFA income'!G20+'3b ESFA income'!G22)/'1 Benchmarking data'!F7*1000,0)","v":0},null,{"$f":"IF(F7=\"\",1,0)","v":1}]
[null,"1c","Adult (19+): non-apprenticeship",null,null,null,{"$f":"IFERROR(('3b ESFA income'!G14)/'1 Benchmarking data'!F8*1000,0)","v":0},null,1]
[null,"1d","Adult (19+): apprenticeship",null,null,null,{"$f":"IFERROR(('3b ESFA income'!G19+'3b ESFA income'!G21+'3b ESFA income'!G23)/'1 Benchmarking data'!F9*1000,0)","v":0},null,1]
[]
[null,null,"HEFCE funded learners",null,null,"Number","Average dedicated funding per learner\n£"]
[null,"1e","19+ learners",null,null,null,{"$f":"IFERROR(('3a Income'!G18+'3a Income'!G19)/'1 Benchmarking data'!F12*1000,0)","v":0},null,{"$f":"IF(F12=\"\",1,0)","v":1}]
[]
[null,null,"Total ESFA and HEFCE funded learners",null,null,"Number","Average total income per learner\n£"]
[null,"1f","Total ESFA and HEFCE funded learners",null,null,{"$f":"F6+F7+F8+F9+F12","v":0},{"$f":"IFERROR('3 SOCI'!G12/'1 Benchmarking data'!F15*1000,0)","v":0}]
{"$rows_left_out":254}
{"sheet":"2 Financial health","index":5,"n_rows":101,"n_cols":7,"rows_kept":101,"cut":false,"hidden":false,"merged":[[5,1,5,4],[25,1,32,6],[6,2,6,4],[7,2,7,4],[8,2,8,4],[11,1,11,4],[12,2,12,4],[13,2,13,4],[14,2,14,4],[16,2,16,4],[18,2,18,4],[22,2,22,4],[19,2,19,4],[20,2,20,4]]}
[null,{"$f":"Contents!B1","v":""}]
[null,"Schedule 2: Financial health grade"]
[]
[null,null,null,null,null,"Cross reference",{"$f":"+'Cover sheet'!C14","v":"2017"}]
[]
[null,"Ratios"]
[null,1,"Adjusted current ratio ",null,null,"2b Ratios #2d",{"$f":"+'2b Ratios'!G11","v":0}]
[null,2,"EBITDA as a % of income - education specific",null,null,"2b Ratios #5j",{"$f":"'2b Ratios'!G35","v":0}]
[null,3,"Borrowing as a % of income ",null,null,"2b Ratios #4c",{"$f":"+'2b Ratios'!G21","v":0}]
[]
[]
[null,"Calculation of grade"]
[null,4,"Adjusted current ratio ",null,null,null,{"$f":"IF(SUM(G7:G9)=0,\"\",IF(G7<0.5,0,VLOOKUP(G7,$E$42:$G$51,2,TRUE)))","v":""}]
[null,5,"EBITDA as a % of income - education specific",null,null,null,{"$f":"IF(SUM(G7:G9)=0,\"\",IF(G8<0.01,0,VLOOKUP(G8,$E$54:$G$63,2,TRUE)))","v":""}]
[null,6,"Borrowing as a % of income ",null,null,null,{"$f":"IF(SUM(G7:G9)=0,\"\",IF(G9>=0.6,0,VLOOKUP(G9,$E$66:$G$76,2,TRUE)))","v":""}]
{"$rows_left_out":87}
{"sheet":"2b Ratios","index":6,"n_rows":64,"n_cols":7,"rows_kept":64,"cut":false,"hidden":false,"merged":[[61,2,61,4],[45,2,45,4],[48,2,48,4],[47,2,47,4],[57,2,57,4],[60,2,60,4],[55,2,55,4],[52,2,52,4],[59,2,59,4],[46,2,46,4],[50,2,50,4],[12,2,12,4],[14,2,14,4],[15,2,15,4],[44,2,44,4],[56,2,56,4],[53,2,53,4],[28,2,28,4],[33,2,33,4],[64,1,71,6],[19,2,19,4],[20,2,20,4],[29,2,29,4],[30,2,30,4],[36,2,36,4],[31,2,31,4],[32,2,32,4],[34,2,34,4],[38,2,38,4],[39,2,39,4],[40,2,40,4],[41,2,41,4],[51,2,51,4],[58,2,58,4],[42,2,42,4],[4,2,4,4],[6,2,6,4],[7,2,7,4],[37,2,37,4],[9,2,9,4],[10,2,10,4],[17,2,17,4],[18,2,18,4],[27,2,27,4],[24,2,24,4],[25,2,25,4],[21,2,21,4],[22,2,22,4],[8,2,8,4],[26,2,26,4],[11,2,11,4]]}
[null,{"$f":"Contents!B1","v":""}]
[null,"Schedule 2b: Ratio analysis"]
[null,null,null,null,null,"Cross reference",{"$f":"+'Cover sheet'!C14","v":"2017"}]
[]
[null,1,"Income used in ratio analysis (£000)",null,null,null,{"$f":"'3a Income'!G68-'3a Income'!G12-'3a Income'!G20-'3a Income'!G57-'3a Income'!G65","v":0}]
[]
[null,2,"Liquidity"]
[null,"2a","Cash days in hand",null,null,null,{"$f":"IF(G5=0,0,(('4 BS'!G20+'4 BS'!G21-'4 BS'!G26)/G5)*365)","v":0}]
[null,"2b","Adjusted cash days in hand",null,null,null,{"$f":"IF(G5=0,0,(('4 BS'!G21-'4 BS'!G26)/G5)*365)","v":0}]
[null,"2c","Current ratio",null,null,null,{"$f":"IF('4 BS'!G36=0,0,'4 BS'!G23/-'4 BS'!G36)","v":0}]
[null,"2d","Adjusted current ratio",null,null,null,{"$f":"IF('4 BS'!G36=0,0,('4 BS'!G23-'4 BS'!G20-'4 BS'!G16)/(-'4 BS'!G36-'4 BS'!G35-'1 Benchmarking data'!G92))","v":0}]
[null,"2e","Trade debtors days - excl funding body grants",null,null,null,{"$f":"IF('3a Income'!G19+'3a Income'!G45+'3a Income'!G50+'3a Income'!G60-'3a Income'!G57=0,0,'4 BS'!G18/('3a Income'!G19+'3a Income'!G45+'3a Income'!G50+'3a Income'!G60-'3a Income'!G57)*365)","v":0}]
[null,"2f","Trade creditors days - non-pay expenditure",null,null,null,{"$f":"IF('3e Non-pay costs'!G22=0,0,'4 BS'!G30/('3e Non-pay costs'!G22)*365)","v":0}]
[]
[null,3,"Ability to generate cash"]
{"$rows_left_out":50}
{"sheet":"3 SOCI","index":7,"n_rows":50,"n_cols":9,"rows_kept":50,"cut":false,"hidden":false,"merged":[[40,2,40,4],[44,2,44,4],[42,2,42,4],[50,1,57,6],[41,2,41,4],[47,2,47,4],[43,2,43,4],[45,2,45,4],[46,2,46,4],[38,2,38,4],[11,2,11,4],[36,2,36,4],[37,2,37,4],[35,2,35,4],[9,2,9,4],[33,2,33,4],[24,2,24,4],[30,2,30,4],[31,2,31,4],[29,2,29,4],[26,2,26,4],[2,5,3,5],[5,2,5,4],[13,2,13,4],[20,2,20,4],[28,2,28,4],[23,2,23,4],[15,2,15,4],[21,2,21,4],[22,2,22,4],[16,2,16,4],[18,2,18,4],[6,2,6,4],[14,2,14,4],[7,2,7,4],[8,2,8,4],[10,2,10,4]]}
[null,{"$f":"Contents!B1","v":""}]
[null,"Schedule 3: Statement of comprehensive income"]
[null,null,null,null,null,"Cross reference",{"$f":"'Cover sheet'!C14","v":"2017"}]
[null,null,null,null,null,null,"£000"]
[]
[null,1,"Income"]
[null,"1a","Funding body grants ",null,null,"3a Income #1d",{"$f":"+'3a Income'!G29","v":0}]
[null,"1b","Tuition fees and education contracts",null,null,"3a Income #2n",{"$f":"+'3a Income'!G45","v":0}]
[null,"1c","Other grants and contracts",null,null,"3a Income #3c",{"$f":"+'3a Income'!G50","v":0}]
[null,"1d","Other income ",null,null,"3a Income #4h",{"$f":"+'3a Income'!G60","v":0}]
[null,"1e","Endowment and investment income",null,null,"3a Income #5d",{"$f":"+'3a Income'!G66","v":0}]
[null,"1f","Total income",null,null,null,{"$f":"SUM(G7:G11)","v":0}]
[]
[null,2,"Expenditure"]
[null,"2a","Staff costs",null,null,"3d Staff costs #3",{"$f":"'3d Staff costs'!G30","v":0}]
{"$rows_left_out":36}
{"sheet":"4 BS","index":8,"n_rows":64,"n_cols":9,"rows_kept":64,"cut":false,"hidden":false,"merged":[[64,1,71,6],[45,2,45,4],[47,2,47,4],[58,2,58,4],[59,2,59,4],[60,2,60,4],[51,2,51,4],[52,2,52,4],[56,2,56,4],[57,2,57,4],[34,2,34,4],[46,2,46,4],[54,2,54,4],[50,2,50,4],[49,2,49,4],[35,2,35,4],[37,2,37,4],[39,2,39,4],[41,2,41,4],[42,2,42,4],[44,2,44,4],[43,2,43,4],[29,2,29,4],[30,2,30,4],[31,2,31,4],[32,2,32,4],[33,2,33,4],[22,2,22,4],[24,2,24,4],[25,2,25,4],[26,2,26,4],[28,2,28,4],[27,2,27,4],[2,5,3,5],[17,2,17,4],[18,2,18,4],[19,2,19,4],[20,2,20,4],[5,2,5,4],[6,2,6,4],[7,2,7,4],[16,2,16,4],[14,2,14,4],[15,2,15,4],[8,2,8,4],[9,2,9,4],[10,2,10,4],[12,2,12,4]]}
[null,{"$f":"Contents!B1","v":""}]
[null,"Schedule 4: Balance sheet"]
[null,null,null,null,null,"Cross reference",{"$f":"+'Cover sheet'!C14","v":"2017"}]
[null,null,null,null,null,null,"£000"]
[]
[null,1,"Non current assets"]
[null,"1a","Land & buildings",null,null,null,null,null,{"$f":"IF(G7=\"\",1,0)","v":1}]
[null,"1b","Equipment",null,null,null,null,null,{"$f":"IF(G8=\"\",1,0)","v":1}]
[null,"1c","Investments",null,null,null,null,null,{"$f":"IF(G9=\"\",1,0)","v":1}]
[null,"1d","Other",null,null,null,null,null,{"$f":"IF(G10=\"\",1,0)","v":1}]
[null,"1e","Total non current assets",null,null,null,{"$f":"SUM(G7:G10)","v":0}]
[]
[null,2,"Debtors: amounts falling due after one year",null,null,null,null,null,{"$f":"IF(G13=\"\",1,0)","v":1}]
[]
[null,3,"Current assets"]
{"$rows_left_out":50}
{"sheet":"5 Cashflow","index":9,"n_rows":60,"n_cols":9,"rows_kept":60,"cut":false,"hidden":false,"merged":[[17,2,17,4],[18,2,18,4],[20,2,20,4],[19,2,19,4],[36,2,36,4],[5,2,5,4],[33,2,33,4],[32,2,32,4],[22,2,22,4],[14,2,14,4],[15,2,15,4],[16,2,16,4],[24,2,24,4],[10,2,10,4],[11,2,11,4],[12,2,12,4],[13,2,13,4],[6,2,6,4],[7,2,7,4],[9,2,9,4],[27,2,27,4],[55,2,55,4],[23,2,23,4],[60,1,67,6],[41,2,41,4],[25,2,25,4],[26,2,26,4],[34,2,34,4],[40,2,40,4],[49,2,49,4],[39,2,39,4],[37,2,37,4],[38,2,38,4],[2,5,3,5],[8,2,8,4],[56,2,56,4],[31,2,31,4],[43,2,43,4],[28,2,28,4],[35,2,35,4],[30,2,30,4],[54,2,54,4],[50,2,50,4],[46,2,46,4],[52,2,52,4],[47,2,47,4],[48,2,48,4],[45,2,45,4],[44,2,44,4]]}
[null,{"$f":"Contents!B1","v":""},null,null," "]
[null,"Schedule 5: Statement of cash flows"]
[null,null,null,null," ","Cross reference",{"$f":"'Cover sheet'!C14","v":"2017"}]
[null,null,null,null,null,null,"£000"]
[]
[null,1,"Cash flows from operating activities"]
[null,"1a","Surplus/(deficit) for the year",null,null,"3-SOCI #7",{"$f":"'3 SOCI'!G34","v":0}]
[null,"1b","Depreciation ",null,null,"3-SOCI #4a",{"$f":"'3 SOCI'!G22","v":0}]
[null,"1c","Taxation",null,null,null,null,null,{"$f":"IF(G9=\"\",1,0)","v":1}]
[null,"1d","(Increase)/decrease in stocks",null,null,null,null,null,1]
[null,"1e","Pension Costs less contributions payable",null,null,null,null,null,1]
[null,"1f","Lump sum pension settlement payments",null,null,null,null,null,1]
[null,"1g","Enhanced pension adjustment",null,null,null,null,null,1]
[null,"1h","(Increase)/decrease in debtors",null,null,null,null,null,1]
[null,"1i","Increase/(decrease) in creditors due within one year",null,null,null,null,null,1]
{"$rows_left_out":46}
{"sheet":"3a Income","index":10,"n_rows":70,"n_cols":9,"rows_kept":70,"cut":false,"hidden":false,"merged":[[38,2,38,4],[26,2,26,4],[2,5,3,5],[70,1,77,6],[67,2,67,4],[48,2,48,4],[49,2,49,4],[63,2,63,4],[64,2,64,4],[65,2,65,4],[55,2,55,4],[56,2,56,4],[57,2,57,4],[59,2,59,4],[61,2,61,4],[62,2,62,4],[51,2,51,4],[52,2,52,4],[58,2,58,4],[34,2,34,4],[39,2,39,4],[40,2,40,4],[41,2,41,4],[42,2,42,4],[53,2,53,4],[43,2,43,4],[44,2,44,4],[46,2,46,4],[47,2,47,4],[54,2,54,4],[35,2,35,4],[36,2,36,4],[37,2,37,4],[28,2,28,4],[30,2,30,4],[31,2,31,4],[32,2,32,4],[33,2,33,4],[25,2,25,4],[17,2,17,4],[18,2,18,4],[19,2,19,4],[20,2,20,4],[23,2,23,4],[21,2,21,4],[11,2,11,4],[12,2,12,4],[13,2,13,4],[16,2,16,4],[24,2,24,4],[14,2,14,4],[5,2,5,4],[7,2,7,4],[8,2,8,4],[9,2,9,4],[10,2,10,4]]}
[null,{"$f":"Contents!B1","v":""}]
[null,"Schedule 3a: Analysis of income"]
[null,null,null,null,null,"Cross reference",{"$f":"'Cover sheet'!C14","v":"2017"}]
[null,null,null,null,null,null,"£000"]
[]
[null,1,"Funding body grants"]
[]
[null,"1a","SFA and EFA grants"]
[null,"1ai","Core EFA funding (excl apprenticeships)",null,null,"3b SFA & EFA income #1e",{"$f":"'3b ESFA income'!G11","v":0}]
[null,"1aii","Core SFA funding",null,null,"3b SFA & EFA income #5",{"$f":"'3b ESFA income'!G29","v":0}]
[null,"1aiii","SFA EU co-financed income",null,null,null,null,null,{"$f":"IF(G11=\"\",1,0)","v":1}]
[null,"1aiv","Release of capital grants",null,null,null,null,null,{"$f":"IF(G12=\"\",1,0)","v":1}]
[null,"1av","Other EFA income",null,null,"3c Other agency income #2g",{"$f":"'3c Other agency income'!G28","v":0}]
[null,"1avi","Other SFA income",null,null,"3c Other agency income #1m",{"$f":"'3c Other agency income'!G19","v":0}]
[null,"1avii","Total SFA and EFA grants",null,null,null,{"$f":"SUM(G9:G14)","v":0}]
{"$rows_left_out":56}
{"sheet":"3b ESFA income","index":11,"n_rows":33,"n_cols":9,"rows_kept":33,"cut":false,"hidden":false,"merged":[[23,2,23,4],[24,2,24,4],[2,5,3,5],[18,2,18,4],[19,2,19,4],[16,2,16,4],[17,2,17,4],[33,1,40,6],[26,2,26,4],[28,2,28,4],[22,2,22,4],[5,2,5,4],[6,2,6,4],[7,2,7,4],[8,2,8,4],[9,2,9,4],[10,2,10,4],[12,2,12,4],[13,2,13,4],[14,2,14,4],[30,2,30,4],[20,2,20,4],[21,2,21,4]]}
[null,{"$f":"Contents!B1","v":""},null,null," "]
[null,"Schedule 3b: Analysis of ESFA income"]
[null,null,null,null,null,"Cross reference",{"$f":"'Cover sheet'!C14","v":"2017"}]
[null,null,null,null,null,null,"£000"]
[]
[null,1,"Core EFA funding (excl apprenticeships)"]
[null,"1a","16-19 programme funding",null,null,null,null,null,{"$f":"IF(G7=\"\",1,0)","v":1}]
[null,"1b","Transitional protection/formula protection funding",null,null,null,null,null,{"$f":"IF(G8=\"\",1,0)","v":1}]
[null,"1c","High needs element 2 funding",null,null,null,null,null,{"$f":"IF(G9=\"\",1,0)","v":1}]
[null,"1d","14-16 funding",null,null,null,null,null,{"$f":"IF(G10=\"\",1,0)","v":1}]
[null,"1e","Total core EFA funding",null,null,null,{"$f":"SUM(G7:G10)","v":0}]
[]
[null,2,"Core SFA funding - adult education budget"]
[null,"2a","Adult Education Budget",null,null,null,null,null,{"$f":"IF(G14=\"\",1,0)","v":1}]
[null,"2b","Total Adult Education Budget",null,null,null,{"$f":"SUM(G14:G14)","v":0}]
{"$rows_left_out":19}
{"sheet":"3c Other agency income","index":12,"n_rows":32,"n_cols":9,"rows_kept":32,"cut":false,"hidden":false,"merged":[[26,2,26,4],[2,5,3,5],[14,2,14,4],[15,2,15,4],[16,2,16,4],[17,2,17,4],[23,2,23,4],[9,2,9,4],[12,2,12,4],[32,1,39,6],[11,2,11,4],[5,2,5,4],[20,2,20,4],[13,2,13,4],[6,2,6,4],[7,2,7,4],[8,2,8,4],[10,2,10,4],[27,2,27,4],[29,2,29,4],[18,2,18,4],[21,2,21,4],[22,2,22,4],[24,2,24,4],[25,2,25,4]]}
[null,{"$f":"Contents!B1","v":""}]
[null,"Schedule 3c: Analysis of other funding body income"]
[null,null,null,null,null,"Cross reference",{"$f":"'Cover sheet'!C14","v":"2017"}]
[null,null,null,null,null,null,"£000"]
[]
[null,1,"Other SFA income"]
[null,"1a","Bursaries and other learner support (SFA)",null,null,null,null,null,{"$f":"IF(G7=\"\",1,0)","v":1}]
[null,"1b","Indirect adult education budget",null,null,null,null,null,1]
[null,"1c","Indirect adult 19+ apprenticeships",null,null,null,null,null,1]
[null,"1d","Indirect 16-18 apprenticeships",null,null,null,null,null,1]
[null,"1e","Exceptional Financial Support Grant",null,null,null,null,null,1]
[null,"1f","Restructuring Facility Support Grant",null,null,null,null,null,1]
[null,"1g","Enter any other SFA income if applicable",null,null,null,null,null,1]
[null,"1h","Enter any other SFA income if applicable",null,null,null,null,null,1]
[null,"1i","Enter any other SFA income if applicable",null,null,null,null,null,1]
{"$rows_left_out":18}
{"sheet":"3d Staff costs","index":13,"n_rows":32,"n_cols":9,"rows_kept":32,"cut":false,"hidden":false,"merged":[[2,5,3,5],[32,1,39,6],[27,2,27,4],[16,2,16,4],[18,2,18,4],[21,2,21,4],[23,2,23,4],[24,2,24,4],[26,2,26,4],[19,2,19,4],[20,2,20,4],[29,2,29,4],[25,2,25,4],[9,2,9,4],[14,2,14,4],[5,2,5,4],[15,2,15,4],[12,2,12,4],[13,2,13,4],[17,2,17,4],[6,2,6,4],[7,2,7,4],[8,2,8,4],[10,2,10,4],[11,2,11,4]]}
[null,{"$f":"Contents!B1","v":""}]
[null,"Schedule 3d: Analysis of staff costs"]
[null,null,null,null,null,"Cross reference",{"$f":"'Cover sheet'!C14","v":"2017"}]
[null,null,null,null,null,null,"£000"]
[]
[null,1,"Staff costs (excl restructuring)"]
[null,"1a","Teaching staff",null,null,null,null,null,{"$f":"IF(G7=\"\",1,0)","v":1}]
[null,"1b","Contracted tuition services (see note)",null,null,null,null,null,{"$f":"IF(G8=\"\",1,0)","v":1}]
[null,"1c","Teaching and other support staff",null,null,null,null,null,1]
[null,"1d","Administration staff",null,null,null,null,null,1]
[null,"1e","Operational staff",null,null,null,null,null,1]
[null,"1f","Maintenance staff",null,null,null,null,null,1]
[null,"1g","Catering, residences and conferences staff",null,null,null,null,null,1]
[null,"1h","Farming activities staff",null,null,null,null,null,1]
[null,"1i","Creche staff",null,null,null,null,null,1]
{"$rows_left_out":18}
{"sheet":"3e Non-pay costs","index":14,"n_rows":32,"n_cols":9,"rows_kept":32,"cut":false,"hidden":false,"merged":[[31,1,38,6],[2,5,3,5],[6,2,6,4],[7,2,7,4],[8,2,8,4],[5,2,5,4],[23,2,23,4],[28,2,28,4],[24,2,24,4],[25,2,25,4],[26,2,26,4],[27,2,27,4],[21,2,21,4],[20,2,20,4],[13,2,13,4],[17,2,17,4],[9,2,9,4],[10,2,10,4],[12,2,12,4],[18,2,18,4],[19,2,19,4],[14,2,14,4],[16,2,16,4],[11,2,11,4],[15,2,15,4]]}
[null,{"$f":"Contents!B1","v":""}]
[null,"Schedule 3e: Analysis of non-pay expenditure"]
[null,null,null,null,null,"Cross reference",{"$f":"'Cover sheet'!C14","v":"2017"}]
[null,null,null,null,null,null,"£000"]
[]
[null,1,"Other operating expenditure"]
[null,"1a","Teaching costs",null,null,null,null,null,{"$f":"IF(G7=\"\",1,0)","v":1}]
[null,"1b","Teaching and other support costs",null,null,null,null,null,{"$f":"IF(G8=\"\",1,0)","v":1}]
[null,"1c","Administration costs",null,null,null,null,null,1]
[null,"1d","Operational costs",null,null,null,null,null,1]
[null,"1e","Maintenance costs",null,null,null,null,null,1]
[null,"1f","Examination costs",null,null,null,null,null,1]
[null,"1g","Rent and lease costs",null,null,null,null,null,1]
[null,"1h","Catering, residences and conferences costs",null,null,null,null,null,1]
[null,"1i","Farming activities costs",null,null,null,null,null,1]
{"$rows_left_out":18}
{"sheet":"3f Miscellaneous","index":15,"n_rows":49,"n_cols":9,"rows_kept":49,"cut":false,"hidden":false,"merged":[[43,2,43,4],[39,2,39,3],[40,2,40,3],[25,2,25,4],[26,2,26,3],[27,2,27,3],[29,2,29,3],[38,2,38,3],[49,1,56,6],[11,2,11,4],[12,2,12,4],[13,2,13,4],[14,2,14,4],[15,2,15,4],[18,2,18,4],[21,2,21,4],[35,2,35,4],[36,2,36,4],[32,2,32,3],[33,2,33,3],[23,2,23,4],[28,2,28,4],[45,2,45,4],[9,2,9,4],[46,2,46,3],[2,5,3,5],[5,2,5,4],[6,2,6,4],[7,2,7,4],[8,2,8,4],[30,2,30,3],[44,2,44,4],[41,2,41,3],[42,2,42,3],[17,2,17,4],[22,2,22,4],[20,2,20,4],[31,2,31,3],[37,2,37,3]]}
[null,{"$f":"Contents!B1","v":""}]
[null,"Schedule 3f: Miscellaneous details"]
[null,null,null,null,null,"Cross reference",{"$f":"'Cover sheet'!C14","v":"2017"}]
[null,null,null,null,null,null,"£000"]
[]
[null,1,"Principal's remuneration"]
[null,"1a","Principal's salary",null,null,null,null,null,{"$f":"IF(G7=\"\",1,0)","v":1}]
[null,"1b","Principal's benefits in kind",null,null,null,null,null,{"$f":"IF(G8=\"\",1,0)","v":1}]
[null,"1c","Principal's pension contribution",null,null,null,null,null,{"$f":"IF(G9=\"\",1,0)","v":1}]
[null,"1d","Have multiple persons held the position during the year?",null,null,null,"SELECT FROM LIST"]
[]
[null,2,"Audit fees"]
[null,"2a","External audit (incl regularity report)",null,null,null,null,null,{"$f":"IF(G13=\"\",1,0)","v":1}]
[null,"2b","Internal audit",null,null,null,null,null,{"$f":"IF(G14=\"\",1,0)","v":1}]
[null,"2c","Other services provided by external auditor",null,null,null,null,null,{"$f":"IF(G15=\"\",1,0)","v":1}]
{"$rows_left_out":35}
{"sheet":"List of colleges","index":16,"n_rows":317,"n_cols":12,"rows_kept":317,"cut":false,"hidden":false,"merged":[]}
[null,null,null,null,null,null,null,0,null,"SELECT FROM LIST",null,"SELECT FROM LIST"]
["Abingdon and Witney College","GFEC","ABING",112314,"SE","SFA",null,1,null,"Unqualified",null,"Yes"]
["Accrington and Rossendale College","TC","ACCRO",106762,"NW","SFA",null,2,null,"Qualified",null,"No"]
["Activate Learning","GFEC","OXFFE",116105,"SE","SFA",null,3,null,null,null,"N/A"]
["Ada National College for Digital Skills","GFEC","NCDSK",134707,null,"SFA",null,4]
["Alton College","SFC","ALTON",108469,"SE","EFA",null,5]
["Amersham and Wycombe College","GFEC","AMWYC",105019,"SE","SFA",null,6]
["Aquinas College","SFC","AQUIN",108372,"NW","EFA",null,7]
["Ashton-Under-Lyne Sixth Form College","SFC","ASHTN",108439,"NW","EFA",null,8]
["Askham Bryan College","A&HC","ASKBR",105948,"YH","SFA",null,9]
["Aylesbury College","GFEC","AYLES",108983,"SE","SFA",null,10]
["Barking and Dagenham College","GFEC","BARKG",106542,"GL","SFA",null,11]
["Barnet  and Southgate College","GFEC","BARNT",108532,"GL","SFA",null,12]
["Barnfield College","GFEC","BARFI",105000,"EE","SFA",null,13]
["Barnsley College","TC","BNSLY",107013,"YH","SFA",null,14]
{"$rows_left_out":303}
{"sheet":"List of auditors","index":17,"n_rows":79,"n_cols":1,"rows_kept":79,"cut":false,"hidden":false,"merged":[]}
["SELECT FROM LIST"]
["Allotts                  "]
["Anderson Barrowcliff     "]
["Baker Tilly              "]
["BDO"]
["Bishop Fleming           "]
["Buzzacott                "]
["Chadwick                 "]
["Clement Keys"]
["Crowe Clark Whitehill LLP"]
["Deloitte"]
["Dodd & Co            "]
["Ernst & Young        "]
["Evolution Audit"]
["Francis Clark            "]
{"$rows_left_out":64}