application_source,rep_status,stage_resolved,final_decision,scheme,gender,age,main_injury,rejection_or_reduction_reasons,first_decision,review_decision,appeal_decision,value_of_award,days_to_first_decision
On-line application,Not represented,Review,Full award,2012 Scheme,Male,18 to 40,NO DATA OR REDACTED AS RARE,NO_DATA,Full award,Full award,,1900,324
On-line application,Represented,Initial application,Full award,2008 Scheme,Male,18 to 40,ARTHROSCOPY - NO FRACTURE,NO_DATA,Full award,,,2000,1309
On-line application,Not represented,Initial application,Full award,2008 Scheme,Male,18 to 40,ARTHROSCOPY - NO FRACTURE,NO_DATA,Full award,,,1000,959
On-line application,Represented,Review,Full award,2008 Scheme,Female,41 to 64,ARTHROSCOPY - NO FRACTURE,NO_DATA,Nil award,Full award,,2000,526
On-line application,Represented,Review,Full award,2008 Scheme,Female,41 to 64,ARTHROSCOPY - NO FRACTURE,NO_DATA,Full award,Full award,,2000,1033
On-line application,Represented,Initial application,Full award,2008 Scheme,Female,41 to 64,NO DATA OR REDACTED AS RARE,NO_DATA,Full award,,,0,1172
On-line application,Represented,Review,Full award,2008 Scheme,Female,41 to 64,NO DATA OR REDACTED AS RARE,NO_DATA,Nil award,Full award,,2000,1440
On-line application,Represented,Initial application,Full award,2001 Scheme,Male,18 to 40,NO DATA OR REDACTED AS RARE,NO_DATA,Full award,,,0,2922
On-line application,Represented,Appeal,Full award,2008 Scheme,Male,41 to 64,NO DATA OR REDACTED AS RARE,NO_DATA,Nil award,Nil award,Full award,775,574
Telephone application,Not represented,Review,Full award,2012 Scheme,Male,18 to 40,BLUR/DOUBLE VISION MODERATE,NO_DATA,Full award,Full award,,7145,532
On-line application,Represented,Review,Full award,2012 Scheme,Male,18 to 40,BLUR/DOUBLE VISION MODERATE,NO_DATA,Full award,Full award,,6870,230
Telephone application,Represented,Initial application,Full award,2012 Scheme,Male,41 to 64,BLUR/DOUBLE VISION MODERATE,NO_DATA,Full award,,,5820,653
On-line application,Not represented,Initial application,Full award,2012 Scheme,Female,18 to 40,BLUR/DOUBLE VISION MODERATE,NO_DATA,Full award,,,7070,495
On-line application,Represented,Initial application,Full award,2012 Scheme,Male,18 to 40,BLUR/DOUBLE VISION MODERATE,NO_DATA,Full award,,,6920,430
Telephone application,Represented,Initial application,Full award,2008 Scheme,Male,41 to 64,BLUR/DOUBLE VISION MODERATE,NO_DATA,Full award,,,10840,897
On-line application,Represented,Review,Full award,2012 Scheme,Male,41 to 64,BLUR/DOUBLE VISION MODERATE,NO_DATA,Full award,Full award,,7280,250
Telephone application,Not represented,Initial application,Full award,2008 Scheme,Male,18 to 40,BLUR/DOUBLE VISION SLIGHT,NO_DATA,Full award,,,5375,1012
On-line application,Represented,Initial application,Full award,2012 Scheme,Male,18 to 40,BLUR/DOUBLE VISION SLIGHT,NO_DATA,Full award,,,3345,716
On-line application,Represented,Initial application,Full award,2012 Scheme,Female,18 to 40,BLUR/DOUBLE VISION SLIGHT,NO_DATA,Full award,,,2400,617
Telephone application,Not represented,Initial application,Full award,2012 Scheme,Male,18 to 40,BLUR/DOUBLE VISION SLIGHT,NO_DATA,Full award,,,1900,486
Telephone application,Not represented,Initial application,Full award,2012 Scheme,Male,18 to 40,BLUR/DOUBLE VISION SLIGHT,NO_DATA,Full award,,,3270,722
On-line application,Represented,Review,Full award,2012 Scheme,Male,18 to 40,BLUR/DOUBLE VISION SLIGHT,NO_DATA,Full award,Full award,,3345,398
On-line application,Represented,Initial application,Full award,2012 Scheme,Male,18 to 40,BLUR/DOUBLE VISION SLIGHT,NO_DATA,Full award,,,3306,481
On-line application,Represented,Initial application,Full award,2012 Scheme,Male,41 to 64,BLUR/DOUBLE VISION SLIGHT,NO_DATA,Full award,,,3345,377
Telephone application,Represented,Review,Full award,2012 Scheme,Male,41 to 64,BLUR/DOUBLE VISION SLIGHT,NO_DATA,Full award,Full award,,3345,618
On-line application,Represented,Review,Full award,2012 Scheme,Male,41 to 64,BLUR/DOUBLE VISION SLIGHT,NO_DATA,Full award,Full award,,3345,429
Telephone application,Not represented,Initial application,Full award,2012 Scheme,Male,41 to 64,BLUR/DOUBLE VISION SLIGHT,NO_DATA,Full award,,,3120,271
On-line application,Represented,Initial application,Full award,2012 Scheme,Male,41 to 64,BLUR/DOUBLE VISION SLIGHT,NO_DATA,Full award,,,3345,298
Telephone application,Represented,Initial application,Full award,2008 Scheme,Male,65 and above,BLUR/DOUBLE VISION SLIGHT,NO_DATA,Full award,,,2690,934
On-line application,Represented,Initial application,Full award,2012 Scheme,Male,0 to 17,BLUR/DOUBLE VISION SLIGHT,NO_DATA,Full award,,,2970,465
On-line application,Not represented,Initial application,Full award,2012 Scheme,Male,0 to 17,BLUR/DOUBLE VISION SLIGHT,NO_DATA,Full award,,,2700,631
Telephone application,Represented,Initial application,Full award,2012 Scheme,Male,18 to 40,BLUR/DOUBLE VISION SLIGHT,NO_DATA,Full award,,,3120,597
On-line application,Not represented,Initial application,Full award,2012 Scheme,Male,18 to 40,BLUR/DOUBLE VISION SLIGHT,NO_DATA,Full award,,,2850,411
On-line application,Represented,Initial application,Full award,2012 Scheme,Male,18 to 40,BLUR/DOUBLE VISION SLIGHT,NO_DATA,Full award,,,3270,548
On-line application,Represented,Initial application,Full award,2012 Scheme,Male,18 to 40,BLUR/DOUBLE VISION SLIGHT,NO_DATA,Full award,,,3120,406
On-line application,Represented,Review,Full award,2012 Scheme,Male,18 to 40,BLUR/DOUBLE VISION SLIGHT,NO_DATA,Nil award,Full award,,2400,414
On-line application,Not represented,Initial application,Full award,2012 Scheme,Female,18 to 40,BLUR/DOUBLE VISION SLIGHT,NO_DATA,Full award,,,3075,535
On-line application,Not represented,Initial application,Full award,2012 Scheme,Male,18 to 40,BLUR/DOUBLE VISION SLIGHT,NO_DATA,Full award,,,3000,415
On-line application,Not represented,Review,Full award,2012 Scheme,Male,18 to 40,BLUR/DOUBLE VISION SLIGHT,NO_DATA,Full award,Full award,,3270,335
On-line application,Not represented,Initial application,Full award,2012 Scheme,Male,18 to 40,BLUR/DOUBLE VISION SLIGHT,NO_DATA,Full award,,,3120,225
On-line application,Represented,Review,Full award,2012 Scheme,Male,18 to 40,BLUR/DOUBLE VISION SLIGHT,NO_DATA,Nil award,Full award,,3345,137
On-line application,Not represented,Initial application,Full award,2012 Scheme,Male,18 to 40,BLUR/DOUBLE VISION SLIGHT,NO_DATA,Full award,,,3120,738
On-line application,Not represented,Initial application,Full award,2008 Scheme,Male,18 to 40,BLUR/DOUBLE VISION SLIGHT,NO_DATA,Full award,,,3375,1125
On-line application,Not represented,Initial application,Full award,2012 Scheme,Male,18 to 40,BLUR/DOUBLE VISION SLIGHT,NO_DATA,Full award,,,3120,272
On-line application,Represented,Review,Full award,2008 Scheme,Male,41 to 64,BLUR/DOUBLE VISION SLIGHT,NO_DATA,Full award,Full award,,0,528
Telephone application,Represented,Initial application,Full award,2012 Scheme,Male,41 to 64,BLUR/DOUBLE VISION SLIGHT,NO_DATA,Full award,,,3090,540
On-line application,Not represented,Initial application,Full award,2012 Scheme,Male,41 to 64,BLUR/DOUBLE VISION SLIGHT,NO_DATA,Full award,,,2400,485
On-line application,Not represented,Review,Reduced award,2008 Scheme,Male,41 to 64,BLUR/DOUBLE VISION SLIGHT,"Conduct before, during or after the incident",Nil award,Reduced award,,1486.25,167
On-line application,Not represented,Review,Full award,2001 Scheme,Female,0 to 17,BRAIN DAMAGE MODERATE,NO_DATA,Full award,Full award,,18810,3108
On-line application,Not represented,Initial application,Full award,2001 Scheme,Male,0 to 17,BRAIN DAMAGE MODERATE,NO_DATA,Full award,,,18120,2530
On-line application,Represented,Appeal,Full award,2001 Scheme,Male,18 to 40,BRAIN DAMAGE MODERATE,NO_DATA,Nil award,Nil award,Full award,25510,1884
On-line application,Represented,Appeal,Full award,2001 Scheme,Male,41 to 64,BRAIN DAMAGE MODERATE,NO_DATA,Nil award,Nil award,Full award,260759,60
On-line application,Represented,Initial application,Full award,2001 Scheme,Male,0 to 17,BRAIN DAMAGE SERIOUS,NO_DATA,Full award,,,139364,3911
On-line application,Represented,Review,Full award,2001 Scheme,Male,0 to 17,BRAIN DAMAGE SERIOUS,NO_DATA,Full award,Full award,,421939,866
On-line application,Represented,Appeal,Full award,2001 Scheme,Male,0 to 17,BRAIN DAMAGE SERIOUS,NO_DATA,Full award,Full award,Full award,500000,1030
On-line application,Represented,Review,Full award,2001 Scheme,Male,0 to 17,BRAIN DAMAGE SERIOUS,NO_DATA,Full award,Full award,,500000,2702
On-line application,Represented,Review,Full award,2001 Scheme,Male,0 to 17,BRAIN DAMAGE SERIOUS,NO_DATA,Full award,Full award,,365972,604
On-line application,Represented,Appeal,Full award,2001 Scheme,Male,18 to 40,BRAIN DAMAGE SERIOUS,NO_DATA,Full award,Full award,Full award,500000,439
On-line application,Represented,Review,Reduced award,2001 Scheme,Male,18 to 40,BRAIN DAMAGE SERIOUS,Applicants criminal record/character,Nil award,Reduced award,,162876,1147
On-line application,Represented,Initial application,Reduced award,2001 Scheme,Male,18 to 40,BRAIN DAMAGE SERIOUS,"Conduct before, during or after the incident",Reduced award,,,375000,2822
On-line application,Represented,Initial application,Full award,2001 Scheme,Male,18 to 40,BRAIN DAMAGE SERIOUS,NO_DATA,Full award,,,276978,1126
On-line application,Represented,Appeal,Full award,2001 Scheme,Male,18 to 40,BRAIN DAMAGE SERIOUS,NO_DATA,Full award,Full award,Full award,498804.5,2076
On-line application,Represented,Appeal,Full award,2001 Scheme,Male,18 to 40,BRAIN DAMAGE SERIOUS,NO_DATA,Full award,Full award,Full award,500000,3120
On-line application,Represented,Initial application,Full award,2001 Scheme,Male,18 to 40,BRAIN DAMAGE SERIOUS,NO_DATA,Full award,,,393429,2723
On-line application,Represented,Appeal,Reduced award,2001 Scheme,Male,18 to 40,BRAIN DAMAGE SERIOUS,"Conduct before, during or after the incident",Reduced award,Reduced award,Reduced award,300000,4148
On-line application,Represented,Initial application,Full award,2001 Scheme,Male,18 to 40,BRAIN DAMAGE SERIOUS,NO_DATA,Full award,,,78113,3719
On-line application,Represented,Appeal,Full award,2001 Scheme,Male,41 to 64,BRAIN DAMAGE SERIOUS,NO_DATA,Reduced award,Full award,Full award,199358,2072
On-line application,Represented,Initial application,Full award,2001 Scheme,Female,41 to 64,BRAIN DAMAGE SERIOUS,NO_DATA,Full award,,,331955,289
On-line application,Represented,Appeal,Full award,2001 Scheme,Male,41 to 64,BRAIN DAMAGE SERIOUS,NO_DATA,Nil award,Full award,Full award,296409,710
On-line application,Represented,Appeal,Full award,2001 Scheme,Male,41 to 64,BRAIN DAMAGE SERIOUS,NO_DATA,Full award,Full award,Full award,457166,2495
On-line application,Represented,Initial application,Full award,2001 Scheme,Male,0 to 17,BRAIN DAMAGE VERY SERIOUS,NO_DATA,Full award,,,500000,3087
On-line application,Represented,Review,Full award,2001 Scheme,Male,0 to 17,BRAIN DAMAGE VERY SERIOUS,NO_DATA,Full award,Full award,,465357,4420
On-line application,Represented,Initial application,Full award,2001 Scheme,Female,0 to 17,BRAIN DAMAGE VERY SERIOUS,NO_DATA,Full award,,,500000,2640
On-line application,Represented,Initial application,Full award,2001 Scheme,Male,0 to 17,BRAIN DAMAGE VERY SERIOUS,NO_DATA,Full award,,,393735,4358
On-line application,Represented,Initial application,Full award,2001 Scheme,Male,18 to 40,BRAIN DAMAGE VERY SERIOUS,NO_DATA,Full award,,,500000,3008
On-line application,Represented,Review,Reduced award,2001 Scheme,Male,18 to 40,BRAIN DAMAGE VERY SERIOUS,Applicants criminal record/character,Full award,Reduced award,,375000,2692
On-line application,Represented,Appeal,Full award,2001 Scheme,Male,18 to 40,BRAIN DAMAGE VERY SERIOUS,NO_DATA,Full award,Full award,Full award,262931,3844
On-line application,Represented,Appeal,Full award,2001 Scheme,Male,18 to 40,BRAIN DAMAGE VERY SERIOUS,NO_DATA,Full award,Full award,Full award,500000,1252
On-line application,Represented,Review,Full award,2001 Scheme,Male,41 to 64,BRAIN DAMAGE VERY SERIOUS,NO_DATA,Reduced award,Full award,,235267,2638
On-line application,Represented,Review,Full award,2001 Scheme,Male,41 to 64,BRAIN DAMAGE VERY SERIOUS,NO_DATA,Full award,Full award,,356241,1125
Telephone application,Represented,Review,Full award,2008 Scheme,Male,18 to 40,BRAIN INJURY 6-28 WEEKS,NO_DATA,Nil award,Full award,,1500,37
On-line application,Represented,Initial application,Full award,2008 Scheme,Male,41 to 64,BRAIN INJURY 6-28 WEEKS,NO_DATA,Full award,,,1500,1110
Telephone application,Not represented,Initial application,Reduced award,2008 Scheme,Male,41 to 64,BRAIN INJURY 6-28 WEEKS,Applicants criminal record/character,Reduced award,,,750,269
On-line application,Not represented,Initial application,Full award,2008 Scheme,Male,65 and above,BRAIN INJURY 6-28 WEEKS,NO_DATA,Full award,,,1800,1007
On-line application,Not represented,Review,Reduced award,2008 Scheme,Male,65 and above,BRAIN INJURY 6-28 WEEKS,Applicants criminal record/character,Reduced award,Reduced award,,1050,529
On-line application,Represented,Initial application,Full award,2008 Scheme,Male,0 to 17,BRAIN INJURY 6-28 WEEKS,NO_DATA,Full award,,,1500,839
On-line application,Represented,Initial application,Full award,2008 Scheme,Male,18 to 40,BRAIN INJURY 6-28 WEEKS,NO_DATA,Full award,,,0,1480
Telephone application,Not represented,Initial application,Full award,2008 Scheme,Female,18 to 40,BRAIN INJURY 6-28 WEEKS,NO_DATA,Full award,,,1500,1094
Telephone application,Not represented,Initial application,Full award,2008 Scheme,Female,18 to 40,BRAIN INJURY 6-28 WEEKS,NO_DATA,Full award,,,1250,850
On-line application,Not represented,Initial application,Full award,2008 Scheme,Male,18 to 40,BRAIN INJURY 6-28 WEEKS,NO_DATA,Full award,,,1500,1043
On-line application,Represented,Review,Full award,2008 Scheme,Female,41 to 64,BRAIN INJURY 6-28 WEEKS,NO_DATA,Full award,Full award,,1500,271
On-line application,Not represented,Initial application,Full award,2008 Scheme,Female,41 to 64,BRAIN INJURY 6-28 WEEKS,NO_DATA,Full award,,,1500,1102
On-line application,Represented,Initial application,Full award,2008 Scheme,Male,41 to 64,BRAIN INJURY 6-28 WEEKS,NO_DATA,Full award,,,1500,1489
Telephone application,Represented,Initial application,Full award,2008 Scheme,Male,41 to 64,BRAIN INJURY 6-28 WEEKS,NO_DATA,Full award,,,1500,876
Telephone application,Not represented,Initial application,Reduced award,2008 Scheme,Male,41 to 64,BRAIN INJURY 6-28 WEEKS,Applicants criminal record/character,Reduced award,,,1350,935
Telephone application,Represented,Review,Full award,2008 Scheme,Male,18 to 40,BRAIN INJURY OVER 28 WEEKS,NO_DATA,Reduced award,Full award,,6272,438
On-line application,Represented,Appeal,Full award,2008 Scheme,Male,18 to 40,BRAIN INJURY OVER 28 WEEKS,NO_DATA,Nil award,Full award,Full award,3300,201
Telephone application,Represented,Initial application,Full award,2008 Scheme,Male,41 to 64,BRAIN INJURY OVER 28 WEEKS,NO_DATA,Full award,,,4665,953
On-line application,Represented,Initial application,Full award,2008 Scheme,Male,41 to 64,BRAIN INJURY OVER 28 WEEKS,NO_DATA,Full award,,,4050,1312
On-line application,Not represented,Review,Reduced award,2008 Scheme,Male,18 to 40,BRAIN INJURY OVER 28 WEEKS,"Conduct before, during or after the incident",Nil award,Reduced award,,2137.5,820
On-line application,Not represented,Initial application,Reduced award,2008 Scheme,Male,18 to 40,BRAIN INJURY OVER 28 WEEKS,Applicants criminal record/character,Reduced award,,,2535,1470
On-line application,Represented,Review,Full award,2008 Scheme,Female,18 to 40,BRAIN INJURY OVER 28 WEEKS,NO_DATA,Full award,Full award,,3300,189
On-line application,Represented,Initial application,Full award,2008 Scheme,Male,18 to 40,BRAIN INJURY OVER 28 WEEKS,NO_DATA,Full award,,,4087.5,913
On-line application,Not represented,Initial application,Full award,2008 Scheme,Male,18 to 40,BRAIN INJURY OVER 28 WEEKS,NO_DATA,Full award,,,3300,1682
On-line application,Represented,Initial application,Full award,2008 Scheme,Male,41 to 64,BRAIN INJURY OVER 28 WEEKS,NO_DATA,Full award,,,3300,1494
On-line application,Represented,Initial application,Full award,2008 Scheme,Male,41 to 64,BRAIN INJURY OVER 28 WEEKS,NO_DATA,Full award,,,0,1009
On-line application,Not represented,Appeal,Full award,2008 Scheme,Male,41 to 64,BRAIN INJURY OVER 28 WEEKS,NO_DATA,Nil award,Full award,Full award,3300,169
On-line application,Represented,Appeal,Full award,2008 Scheme,Male,41 to 64,BRAIN INJURY OVER 28 WEEKS,NO_DATA,Full award,Reduced award,Full award,3600,721
On-line application,Not represented,Initial application,Full award,2008 Scheme,Female,18 to 40,BRAIN INJURY PERMANENT,NO_DATA,Full award,,,18200,798
Telephone application,Represented,Review,Full award,2008 Scheme,Male,18 to 40,BRAIN INJURY PERMANENT,NO_DATA,Full award,Full award,,8650,489
On-line application,Not represented,Initial application,Full award,2008 Scheme,Female,65 and above,BRAIN INJURY PERMANENT,NO_DATA,Full award,,,10885,54
On-line application,Represented,Initial application,Full award,2008 Scheme,Female,18 to 40,BRAIN INJURY PERMANENT,NO_DATA,Full award,,,9190,877
Telephone application,Not represented,Initial application,Full award,2012 Scheme,Male,18 to 40,BURNS FACE MODERATE,NO_DATA,Full award,,,3500,835
Telephone application,Represented,Review,Reduced award,2008 Scheme,Male,18 to 40,BURNS FACE MODERATE,Applicants criminal record/character,Reduced award,Reduced award,,2750,529
On-line application,Not represented,Initial application,Full award,2012 Scheme,Female,18 to 40,BURNS FACE MODERATE,NO_DATA,Full award,,,3500,426
On-line application,Represented,Review,Full award,2012 Scheme,Male,65 and above,CATARACTS 1 EYE OPERATION REQD,NO_DATA,Nil award,Full award,,1800,265
On-line application,Represented,Initial application,Full award,2012 Scheme,Female,18 to 40,CATARACTS 1 EYE OPERATION REQD,NO_DATA,Full award,,,1500,267
On-line application,Represented,Review,Full award,2012 Scheme,Female,18 to 40,CATARACTS 1 EYE OPERATION REQD,NO_DATA,Nil award,Full award,,1500,405
On-line application,Represented,Review,Full award,2012 Scheme,Female,18 to 40,CATARACTS 1 EYE OPERATION REQD,NO_DATA,Full award,Full award,,1450,546
On-line application,Not represented,Appeal,Full award,2012 Scheme,Male,18 to 40,CLICKING JAW PERMANENT,NO_DATA,Full award,Full award,Full award,4490,337
Telephone application,Not represented,Initial application,Full award,2012 Scheme,Male,18 to 40,CLICKING JAW PERMANENT,NO_DATA,Full award,,,4040,531
On-line application,Represented,Initial application,Full award,2012 Scheme,Male,18 to 40,CLICKING JAW PERMANENT,NO_DATA,Full award,,,4265,797
Telephone application,Not represented,Initial application,Full award,2012 Scheme,Male,18 to 40,CLICKING JAW PERMANENT,NO_DATA,Full award,,,4490,484
On-line application,Represented,Initial application,Full award,2012 Scheme,Male,18 to 40,CLICKING JAW PERMANENT,NO_DATA,Full award,,,3500,321
Telephone application,Not represented,Initial application,Full award,2012 Scheme,Male,18 to 40,CLICKING JAW PERMANENT,NO_DATA,Full award,,,3800,371
Telephone application,Not represented,Review,Full award,2012 Scheme,Male,18 to 40,CLICKING JAW PERMANENT,NO_DATA,Full award,Full award,,3950,337
Telephone application,Not represented,Initial application,Full award,2012 Scheme,Male,18 to 40,CLICKING JAW PERMANENT,NO_DATA,Full award,,,3470,362
On-line application,Represented,Review,Full award,2012 Scheme,Male,18 to 40,CLICKING JAW PERMANENT,NO_DATA,Full award,Full award,,4265,409
Telephone application,Not represented,Initial application,Full award,2012 Scheme,Male,41 to 64,CLICKING JAW PERMANENT,NO_DATA,Full award,,,4190,713
Telephone application,Not represented,Review,Full award,2012 Scheme,Male,41 to 64,CLICKING JAW PERMANENT,NO_DATA,Nil award,Full award,,3500,4
Telephone application,Not represented,Review,Full award,2012 Scheme,Female,41 to 64,CLICKING JAW PERMANENT,NO_DATA,Nil award,Full award,,3500,342
On-line application,Not represented,Initial application,Full award,2012 Scheme,Female,0 to 17,CLICKING JAW PERMANENT,NO_DATA,Full award,,,3500,807
On-line application,Not represented,Initial application,Full award,2012 Scheme,Male,18 to 40,CLICKING JAW PERMANENT,NO_DATA,Full award,,,4220,343
On-line application,Not represented,Initial application,Full award,2012 Scheme,Male,18 to 40,CLICKING JAW PERMANENT,NO_DATA,Full award,,,3950,426
On-line application,Not represented,Initial application,Full award,2012 Scheme,Male,18 to 40,CLICKING JAW PERMANENT,NO_DATA,Full award,,,3500,249
On-line application,Not represented,Review,Full award,2012 Scheme,Male,18 to 40,CLICKING JAW PERMANENT,NO_DATA,Full award,Full award,,3820,793
On-line application,Not represented,Review,Full award,2012 Scheme,Female,18 to 40,CLICKING JAW PERMANENT,NO_DATA,Nil award,Full award,,3400,157
On-line application,Not represented,Appeal,Full award,2012 Scheme,Female,18 to 40,CLICKING JAW PERMANENT,NO_DATA,Full award,Full award,Full award,4490,401
On-line application,Represented,Initial application,Full award,2012 Scheme,Female,18 to 40,CLICKING JAW PERMANENT,NO_DATA,Full award,,,3950,405
On-line application,Not represented,Initial application,Full award,2012 Scheme,Male,18 to 40,CLICKING JAW PERMANENT,NO_DATA,Full award,,,4265,785
On-line application,Not represented,Initial application,Full award,2012 Scheme,Male,18 to 40,CLICKING JAW PERMANENT,NO_DATA,Full award,,,3950,156
On-line application,Not represented,Review,Full award,2012 Scheme,Male,18 to 40,CLICKING JAW PERMANENT,NO_DATA,Nil award,Full award,,3500,482
On-line application,Not represented,Review,Full award,2012 Scheme,Male,18 to 40,CLICKING JAW PERMANENT,NO_DATA,Nil award,Full award,,4265,44
On-line application,Not represented,Initial application,Full award,2012 Scheme,Male,18 to 40,CLICKING JAW PERMANENT,NO_DATA,Full award,,,3950,408
On-line application,Not represented,Review,Full award,2008 Scheme,Male,18 to 40,CLICKING JAW PERMANENT,NO_DATA,Full award,Full award,,7135,547
On-line application,Not represented,Initial application,Full award,2012 Scheme,Male,18 to 40,CLICKING JAW PERMANENT,NO_DATA,Full award,,,4265,269
On-line application,Not represented,Initial application,Full award,2012 Scheme,Female,18 to 40,CLICKING JAW PERMANENT,NO_DATA,Full award,,,4040,575
On-line application,Not represented,Initial application,Full award,2012 Scheme,Female,18 to 40,CLICKING JAW PERMANENT,NO_DATA,Full award,,,3500,770
On-line application,Not represented,Review,Full award,2012 Scheme,Male,18 to 40,CLICKING JAW PERMANENT,NO_DATA,Nil award,Full award,,4445,195
On-line application,Not represented,Initial application,Full award,2012 Scheme,Male,18 to 40,CLICKING JAW PERMANENT,NO_DATA,Full award,,,4220,404
On-line application,Not represented,Initial application,Full award,2012 Scheme,Male,18 to 40,CLICKING JAW PERMANENT,NO_DATA,Full award,,,4040,332
On-line application,Represented,Review,Full award,2012 Scheme,Male,18 to 40,CLICKING JAW PERMANENT,NO_DATA,Nil award,Full award,,3500,194
On-line application,Not represented,Initial application,Full award,2012 Scheme,Male,18 to 40,CLICKING JAW PERMANENT,NO_DATA,Full award,,,3500,357
On-line application,Not represented,Review,Full award,2012 Scheme,Male,18 to 40,CLICKING JAW PERMANENT,NO_DATA,Full award,Full award,,4040,398
On-line application,Not represented,Initial application,Full award,2012 Scheme,Male,18 to 40,CLICKING JAW PERMANENT,NO_DATA,Full award,,,3500,25
On-line application,Not represented,Initial application,Full award,2012 Scheme,Male,18 to 40,CLICKING JAW PERMANENT,NO_DATA,Full award,,,4040,246
On-line application,Not represented,Initial application,Full award,2012 Scheme,Male,18 to 40,CLICKING JAW PERMANENT,NO_DATA,Full award,,,3500,468
On-line application,Not represented,Review,Full award,2012 Scheme,Male,18 to 40,CLICKING JAW PERMANENT,NO_DATA,Full award,Full award,,4265,306