{"text_format":"1","workbook":"xlsx","n_sheets":5,"sheets":["INSTRUCTIONS","Establishment details","Procedure details","mismac","Lists"],"not_rendered":{"charts":0,"images":2,"macros":1,"external_links":0,"defined_names":34,"comments":0,"pivot_tables":0},"unopened":[],"bounds":{"document_bytes":16777216,"sheet_cells":100000,"rows_first":2000,"rows_last":500,"rows_between":2000,"halvings":0,"cell_chars":16384,"cell_head_chars":4096},"cells_cut":0,"cells_raw":0,"read":"whole","date_system":"1900"}

{"sheet":"INSTRUCTIONS","index":0,"n_rows":35,"n_cols":1,"rows_kept":35,"cut":false,"hidden":false,"merged":[[0,0,0,3],[34,0,34,3]]}
["PLEASE ENSURE MACROS ARE ENABLED TO ENSURE THIS SPREADSHEET VALIDATES PROPERLY \n - if the security warning appears (see step 1), you will need to follow the below instructions\n- if no security warning appears, it is likely that macros are already enabled and you will not need to follow the below instructions\nYou will be asked to resubmit the form if macros have not been enabled"]
[]
[]
[]
[]
[]
[]
[]
[]
[]
{"$rows_left_out":26}
{"sheet":"Establishment details","index":1,"n_rows":57,"n_cols":3,"rows_kept":57,"cut":false,"hidden":false,"merged":[[0,0,0,3],[1,0,1,3],[2,0,2,3]]}
[{"$f":"CONCATENATE(\"Animal use data \",C24)","v":"Animal use data 2015"}]
["PLEASE ENSURE MACROS ARE ENABLED TO ENSURE THIS SPREADSHEET VALIDATES PROPERLY (SEE INSTRUCTIONS)\nIf you require assistance, contact ASRU Business Support Team at ROPReturns@homeoffice.gsi.gov.uk or phone 020 7035 0583 / 8625 "]
["Once macros are enabled, the \"procedure details\" tab will only appear if:\n-  'Were any procedures carried out and completed in the reported year?' is Yes and \n- 'Were only larval or embryonic forms used on this project this year?' is No\n\nThroughout this workbook, where a cell has a drop-down box (to the right of it), please use it to enter data"]
[null,"Country:","United Kingdom"]
[]
[null,"Name:"]
[]
[null,"Address:"]
[]
[]
{"$rows_left_out":48}
{"sheet":"Procedure details","index":2,"n_rows":304,"n_cols":23,"rows_kept":304,"cut":false,"hidden":false,"merged":[]}
[]
[]
["EU Submission *","Id 1","Id 2","Id 3","Animal Species","Specify other","Number of Animals","Re-use","Place of birth (origin)","Non-human Primate (NHP) Source (origin)","Non-human Primate (NHP) Generation","Genetic status","Creation of new GL","Purpose","Specify other","Testing by legislation","Specify other","Legislative Requirements (origin of the legislation) ","Actual Severity","Custom Severity","Techniques of Special Interest","Comments","Comments 2"]
[null,{"$f":"'Establishment details'!$C$17","v":0},{"$f":"'Establishment details'!$C$19","v":0},{"$f":"'Establishment details'!$C$22","v":0}]
[null,{"$f":"'Establishment details'!$C$17","v":0},{"$f":"'Establishment details'!$C$19","v":0},{"$f":"'Establishment details'!$C$22","v":0}]
[null,{"$f":"'Establishment details'!$C$17","v":0},{"$f":"'Establishment details'!$C$19","v":0},{"$f":"'Establishment details'!$C$22","v":0}]
[null,{"$f":"'Establishment details'!$C$17","v":0},{"$f":"'Establishment details'!$C$19","v":0},{"$f":"'Establishment details'!$C$22","v":0}]
[null,{"$f":"'Establishment details'!$C$17","v":0},{"$f":"'Establishment details'!$C$19","v":0},{"$f":"'Establishment details'!$C$22","v":0}]
[null,{"$f":"'Establishment details'!$C$17","v":0},{"$f":"'Establishment details'!$C$19","v":0},{"$f":"'Establishment details'!$C$22","v":0}]
[null,{"$f":"'Establishment details'!$C$17","v":0},{"$f":"'Establishment details'!$C$19","v":0},{"$f":"'Establishment details'!$C$22","v":0}]
{"$rows_left_out":295}
{"sheet":"mismac","index":3,"n_rows":305,"n_cols":34,"rows_kept":305,"cut":false,"hidden":true,"merged":[]}
[]
[]
[1,1,1,1,1,1,1,1,1,1,1,1,1,1,1,1,1,1,1,1,1,1,1,1,"counta",1,"other species","primates","PR","REUSE","other purpose","other testing by legislation - LT10","PRIMATES > 99","NON PRIMATES GREATER THAN 9999"]
[null,null,null,null,null,null,null,null,null,null,null,null,null,null,null,null,null,null,null,null,null,null,null,4,{"$f":"COUNTA('Procedure details'!E4:'Procedure details'!V4)","v":0},null,{"$f":"IF('Procedure details'!E4<>\"\",VLOOKUP('Procedure details'!E4,Lists!$M$2:$N$38,2,FALSE),\"\")","v":""},{"$f":"IF('Procedure details'!E4<>\"\",VLOOKUP('Procedure details'!E4,Lists!$M$2:$O$38,3,FALSE),\"\")","v":""},{"$f":"IF('Procedure details'!N4<>\"\",VLOOKUP('Procedure details'!N4,Lists!$B$2:$C$71,2,FALSE),\"\")","v":""},{"$f":"IF('Procedure details'!H4<>\"\",VLOOKUP('Procedure details'!H4,Lists!$AP$2:$AQ$3,2,FALSE),\"\")","v":""},{"$f":"IF('Procedure details'!N4<>\"\",VLOOKUP('Procedure details'!N4,Lists!$B$2:$D$71,3,FALSE),\"\")","v":""},{"$f":"IF('Procedure details'!P4<>\"\",VLOOKUP('Procedure details'!P4,Lists!$AD$2:$AE$11,2,FALSE),\"\")","v":""},{"$f":"IF(AND(AB4=1,'Procedure details'!G4>99,'Procedure details'!V4=\"\"),1,0)","v":0},{"$f":"IF(AND(AB4=0,'Procedure details'!G4>999,'Procedure details'!V4=\"\"),1,0)","v":0}]
[null,null,null,null,null,null,null,null,null,null,null,null,null,null,null,null,null,null,null,null,null,null,null,5,{"$f":"COUNTA('Procedure details'!E5:'Procedure details'!V5)","v":0},null,{"$f":"IF('Procedure details'!E5<>\"\",VLOOKUP('Procedure details'!E5,Lists!$M$2:$N$38,2,FALSE),\"\")","v":""},{"$f":"IF('Procedure details'!E5<>\"\",VLOOKUP('Procedure details'!E5,Lists!$M$2:$O$38,3,FALSE),\"\")","v":""},{"$f":"IF('Procedure details'!N5<>\"\",VLOOKUP('Procedure details'!N5,Lists!$B$2:$C$71,2,FALSE),\"\")","v":""},{"$f":"IF('Procedure details'!H5<>\"\",VLOOKUP('Procedure details'!H5,Lists!$AP$2:$AQ$3,2,FALSE),\"\")","v":""},{"$f":"IF('Procedure details'!N5<>\"\",VLOOKUP('Procedure details'!N5,Lists!$B$2:$D$71,3,FALSE),\"\")","v":""},{"$f":"IF('Procedure details'!P5<>\"\",VLOOKUP('Procedure details'!P5,Lists!$AD$2:$AE$11,2,FALSE),\"\")","v":""},{"$f":"IF(AND(AB5=1,'Procedure details'!G5>99,'Procedure details'!V5=\"\"),1,0)","v":0},{"$f":"IF(AND(AB5=0,'Procedure details'!G5>999,'Procedure details'!V5=\"\"),1,0)","v":0}]
[null,null,null,null,null,null,null,null,null,null,null,null,null,null,null,null,null,null,null,null,null,null,null,6,{"$f":"COUNTA('Procedure details'!E6:'Procedure details'!V6)","v":0},null,{"$f":"IF('Procedure details'!E6<>\"\",VLOOKUP('Procedure details'!E6,Lists!$M$2:$N$38,2,FALSE),\"\")","v":""},{"$f":"IF('Procedure details'!E6<>\"\",VLOOKUP('Procedure details'!E6,Lists!$M$2:$O$38,3,FALSE),\"\")","v":""},{"$f":"IF('Procedure details'!N6<>\"\",VLOOKUP('Procedure details'!N6,Lists!$B$2:$C$71,2,FALSE),\"\")","v":""},{"$f":"IF('Procedure details'!H6<>\"\",VLOOKUP('Procedure details'!H6,Lists!$AP$2:$AQ$3,2,FALSE),\"\")","v":""},{"$f":"IF('Procedure details'!N6<>\"\",VLOOKUP('Procedure details'!N6,Lists!$B$2:$D$71,3,FALSE),\"\")","v":""},{"$f":"IF('Procedure details'!P6<>\"\",VLOOKUP('Procedure details'!P6,Lists!$AD$2:$AE$11,2,FALSE),\"\")","v":""},{"$f":"IF(AND(AB6=1,'Procedure details'!G6>99,'Procedure details'!V6=\"\"),1,0)","v":0},{"$f":"IF(AND(AB6=0,'Procedure details'!G6>999,'Procedure details'!V6=\"\"),1,0)","v":0}]
[null,null,null,null,null,null,null,null,null,null,null,null,null,null,null,null,null,null,null,null,null,null,null,7,{"$f":"COUNTA('Procedure details'!E7:'Procedure details'!V7)","v":0},null,{"$f":"IF('Procedure details'!E7<>\"\",VLOOKUP('Procedure details'!E7,Lists!$M$2:$N$38,2,FALSE),\"\")","v":""},{"$f":"IF('Procedure details'!E7<>\"\",VLOOKUP('Procedure details'!E7,Lists!$M$2:$O$38,3,FALSE),\"\")","v":""},{"$f":"IF('Procedure details'!N7<>\"\",VLOOKUP('Procedure details'!N7,Lists!$B$2:$C$71,2,FALSE),\"\")","v":""},{"$f":"IF('Procedure details'!H7<>\"\",VLOOKUP('Procedure details'!H7,Lists!$AP$2:$AQ$3,2,FALSE),\"\")","v":""},{"$f":"IF('Procedure details'!N7<>\"\",VLOOKUP('Procedure details'!N7,Lists!$B$2:$D$71,3,FALSE),\"\")","v":""},{"$f":"IF('Procedure details'!P7<>\"\",VLOOKUP('Procedure details'!P7,Lists!$AD$2:$AE$11,2,FALSE),\"\")","v":""},{"$f":"IF(AND(AB7=1,'Procedure details'!G7>99,'Procedure details'!V7=\"\"),1,0)","v":0},{"$f":"IF(AND(AB7=0,'Procedure details'!G7>999,'Procedure details'!V7=\"\"),1,0)","v":0}]
[null,null,null,null,null,null,null,null,null,null,null,null,null,null,null,null,null,null,null,null,null,null,null,8,{"$f":"COUNTA('Procedure details'!E8:'Procedure details'!V8)","v":0},null,{"$f":"IF('Procedure details'!E8<>\"\",VLOOKUP('Procedure details'!E8,Lists!$M$2:$N$38,2,FALSE),\"\")","v":""},{"$f":"IF('Procedure details'!E8<>\"\",VLOOKUP('Procedure details'!E8,Lists!$M$2:$O$38,3,FALSE),\"\")","v":""},{"$f":"IF('Procedure details'!N8<>\"\",VLOOKUP('Procedure details'!N8,Lists!$B$2:$C$71,2,FALSE),\"\")","v":""},{"$f":"IF('Procedure details'!H8<>\"\",VLOOKUP('Procedure details'!H8,Lists!$AP$2:$AQ$3,2,FALSE),\"\")","v":""},{"$f":"IF('Procedure details'!N8<>\"\",VLOOKUP('Procedure details'!N8,Lists!$B$2:$D$71,3,FALSE),\"\")","v":""},{"$f":"IF('Procedure details'!P8<>\"\",VLOOKUP('Procedure details'!P8,Lists!$AD$2:$AE$11,2,FALSE),\"\")","v":""},{"$f":"IF(AND(AB8=1,'Procedure details'!G8>99,'Procedure details'!V8=\"\"),1,0)","v":0},{"$f":"IF(AND(AB8=0,'Procedure details'!G8>999,'Procedure details'!V8=\"\"),1,0)","v":0}]
[null,null,null,null,null,null,null,null,null,null,null,null,null,null,null,null,null,null,null,null,null,null,null,9,{"$f":"COUNTA('Procedure details'!E9:'Procedure details'!V9)","v":0},null,{"$f":"IF('Procedure details'!E9<>\"\",VLOOKUP('Procedure details'!E9,Lists!$M$2:$N$38,2,FALSE),\"\")","v":""},{"$f":"IF('Procedure details'!E9<>\"\",VLOOKUP('Procedure details'!E9,Lists!$M$2:$O$38,3,FALSE),\"\")","v":""},{"$f":"IF('Procedure details'!N9<>\"\",VLOOKUP('Procedure details'!N9,Lists!$B$2:$C$71,2,FALSE),\"\")","v":""},{"$f":"IF('Procedure details'!H9<>\"\",VLOOKUP('Procedure details'!H9,Lists!$AP$2:$AQ$3,2,FALSE),\"\")","v":""},{"$f":"IF('Procedure details'!N9<>\"\",VLOOKUP('Procedure details'!N9,Lists!$B$2:$D$71,3,FALSE),\"\")","v":""},{"$f":"IF('Procedure details'!P9<>\"\",VLOOKUP('Procedure details'!P9,Lists!$AD$2:$AE$11,2,FALSE),\"\")","v":""},{"$f":"IF(AND(AB9=1,'Procedure details'!G9>99,'Procedure details'!V9=\"\"),1,0)","v":0},{"$f":"IF(AND(AB9=0,'Procedure details'!G9>999,'Procedure details'!V9=\"\"),1,0)","v":0}]
[null,null,null,null,null,null,null,null,null,null,null,null,null,null,null,null,null,null,null,null,null,null,null,10,{"$f":"COUNTA('Procedure details'!E10:'Procedure details'!V10)","v":0},null,{"$f":"IF('Procedure details'!E10<>\"\",VLOOKUP('Procedure details'!E10,Lists!$M$2:$N$38,2,FALSE),\"\")","v":""},{"$f":"IF('Procedure details'!E10<>\"\",VLOOKUP('Procedure details'!E10,Lists!$M$2:$O$38,3,FALSE),\"\")","v":""},{"$f":"IF('Procedure details'!N10<>\"\",VLOOKUP('Procedure details'!N10,Lists!$B$2:$C$71,2,FALSE),\"\")","v":""},{"$f":"IF('Procedure details'!H10<>\"\",VLOOKUP('Procedure details'!H10,Lists!$AP$2:$AQ$3,2,FALSE),\"\")","v":""},{"$f":"IF('Procedure details'!N10<>\"\",VLOOKUP('Procedure details'!N10,Lists!$B$2:$D$71,3,FALSE),\"\")","v":""},{"$f":"IF('Procedure details'!P10<>\"\",VLOOKUP('Procedure details'!P10,Lists!$AD$2:$AE$11,2,FALSE),\"\")","v":""},{"$f":"IF(AND(AB10=1,'Procedure details'!G10>99,'Procedure details'!V10=\"\"),1,0)","v":0},{"$f":"IF(AND(AB10=0,'Procedure details'!G10>999,'Procedure details'!V10=\"\"),1,0)","v":0}]
{"$rows_left_out":296}
{"sheet":"Lists","index":4,"n_rows":76,"n_cols":83,"rows_kept":76,"cut":false,"hidden":true,"merged":[]}
[null,"Combined Purposes",null,null,null,null,null,null,null,"Code","Type of animal",null,"Code + Type","other","primates",null,null,null,null,"Countries",null,null,"Legislative requirements ",null,null,null,null,null,null,"Toxicity and other safety testing required by legislation",null,null,null,null,null,null,null,"Severity",null,null,null,"Y/N",null,"Place of birth",null,null,null,null,null,null,"Non-human primate - source",null,null,null,null,null,null,"Non-human primate - generation",null,null,null,"Genetic status",null,null,null,null,null,null,"Reporting Years",null,null,"Basic Research",null,null,null,null,null,null,null," "]
[{"$f":"MID(B2,1,6)","v":"[PB1] "},"[PB1] (Basic Research) Oncology",null,null,null,null,null,null,null,"A1","Mice (Mus musculus)",null,{"$f":"CONCATENATE(\"[\",J2,\"] \",K2)","v":"[A1] Mice (Mus musculus)"},null,null,null,null,null,null,"Austria",null,null,"[LO1] Legislation satisfying EU requirements",null,null,null,null,null,null,"[LT1] Legislation on medicinal products for human use",null,null,null,null,null,null,null,"Sub-threshold",null,null,null,"[N] No",0,"[O1_1] Animals born in the UK at a registered breeder",null,null,null,null,null,null,"[NHPO1_1] Animals born at a registered breeder in the UK",null,null,null,null,null,null,"[NHPG1] F0",null,null,null,"[GS1] Not genetically altered",null,null,null,null,null,null,2013,null,null,"Translational and Applied Research",null,null,null,null,null,null,null," "]
[{"$f":"MID(B3,1,6)","v":"[PB2] "},"[PB2] (Basic Research) Cardiovascular Blood and Lymphatic System",null,null,null,null,null,null,null,"A2","Rats (Rattus norvegicus)",null,"[A2] Rats (Rattus norvegicus)",null,null,null,null,null,null,"Belgium",null,null,"[LO2] Legislation satisfying national requirements only [within EU]",null,null,null,null,null,null,"[LT2] Legislation on medicinal products for veterinary use and their residues",null,null,null,null,null,null,null,"[SV1] Non-recovery",null,null,null,"[Y] Yes",1,"[O1_2] Animals born in the EU (non UK) at a registered breeder",null,null,null,null,null,null,"[NHPO1_2] Animals born at a registered breeder within EU (non UK)",null,null,null,null,null,null,"[NHPG2] F1",null,null,null,"[GS2] Genetically altered without a harmful phenotype",null,null,null,null,null,null,2014,null,null,"Regulatory use and Routine production",null,null,null,null,null,null,null," "]
["[PB3] ","[PB3] (Basic Research) Nervous System",null,null,null,null,null,null,null,"A3","Guinea-Pigs (Cavia porcellus)",null,"[A3] Guinea-Pigs (Cavia porcellus)",null,null,null,null,null,null,"Bulgaria",null,null,"[LO3] Legislation satisfying Non-EU requirements only",null,null,null,null,null,null,"[LT3] Medical devices legislation",null,null,null,null,null,null,null,"[SV2] Mild",null,null,null,null,null,"[O2_1] Animals born in the UK but not at a registered breeder",null,null,null,null,null,null,"[NHPO2] Animals born in rest of Europe",null,null,null,null,null,null,"[NHPG3] F2 or greater",null,null,null,"[GS3] Genetically altered with a harmful phenotype",null,null,null,null,null,null,2015,null,null,"[PE40] Protection of the natural environment in the interests of the health or welfare of human beings or animals",null,null,null,null,null,null,null," "]
["[PB4] ","[PB4] (Basic Research) Respiratory System",null,null,null,null,null,null,null,"A4","Hamsters (Syrian) (Mesocricetus auratus)",null,"[A4] Hamsters (Syrian) (Mesocricetus auratus)",null,null,null,null,null,null,"Croatia",null,null,null,null,null,null,null,null,null,"[LT4] Industrial chemicals legislation",null,null,null,null,null,null,null,"[SV3] Moderate",null,null,null,null,null,"[O2_2] Animals born in the EU (non UK) but not at a registered breeder",null,null,null,null,null,null,"[NHPO3] Animals born in Asia",null,null,null,null,null,null,"[NHPG4] Self-sustaining colony",null,null,null,null,null,null,null,null,null,null,null,null,null,"[PS41] Preservation of species",null,null,null,null,null,null,null," "]
["[PB5] ","[PB5] (Basic Research) Gastrointestinal System including Liver",null,null,null,null,null,null,null,"A5","Hamsters (chinese) (Cricetulus griseus)",null,"[A5] Hamsters (chinese) (Cricetulus griseus)",null,null,null,null,null,null,"Cyprus",null,null,null,null,null,null,null,null,null,"[LT5] Plant protection product legislation",null,null,null,null,null,null,null,"[SV4] Severe",null,null,null,null,null,"[O3] Animals born in rest of Europe",null,null,null,null,null,null,"[NHPO4] Animals born in America",null,null,null,null,null,null,null,null,null,null,null,null,null,null,null,null,null,null,null,null,"[PE42] Higher education or training for the acquisition, maintenance or improvement of vocational skills",null,null,null,null,null,null,null," "]
["[PB6] ","[PB6] (Basic Research) Musculoskeletal System",null,null,null,null,null,null,null,"A6","Mongolian gerbil (Meriones unguiculatus)",null,"[A6] Mongolian gerbil (Meriones unguiculatus)",null,null,null,null,null,null,"Czech Republic",null,null,null,null,null,null,null,null,null,"[LT6] Biocides legislation",null,null,null,null,null,null,null,null,null,null,null,null,null,"[O4] Animals born in rest of world",null,null,null,null,null,null,"[NHPO5] Animals born in Africa",null,null,null,null,null,null,null,null,null,null,null,null,null,null,null,null,null,null,null,null,"[PF43] Forensic enquiries",null,null,null,null,null,null,null," "]
["[PB7] ","[PB7] (Basic Research) Immune System",null,null,null,null,null,null,null,"A7","Other Rodents (other Rodentia)",null,"[A7] Other Rodents (other Rodentia)",1,null,null,null,null,null,"Denmark",null,null,null,null,null,null,null,null,null,"[LT7] Food legislation including food contact material",null,null,null,null,null,null,null,null,null,null,null,null,null,null,null,null,null,null,null,null,"[NHPO6] Animals born elsewhere",null,null,null,null,null,null,null,null,null,null,null,null,null,null,null,null,null,null,null,null,"[PG43] Maintenance of colonies of established genetically altered animals, not used in other procedures",null,null,null,null,null,null,null," "]
["[PB8] ","[PB8] (Basic Research) Urogenital/Reproductive System",null,null,null,null,null,null,null,"A8","Rabbits (Oryctolagus cuniculus)",null,"[A8] Rabbits (Oryctolagus cuniculus)",null,null,null,null,null,null,"Estonia",null,null,null,null,null,null,null,null,null,"[LT8] Feed legislation including legislation for the safety of target animals, workers and environment"]
["[PB9] ","[PB9] (Basic Research) Sensory Organs (skin, eyes and ears)",null,null,null,null,null,null,null,"A9","Cats (Felis catus)",null,"[A9] Cats (Felis catus)",null,null,null,null,null,null,"Finland",null,null,null,null,null,null,null,null,null,"[LT9] Cosmetics legislation",null,null,null,null,null,null,null,null,null,null,null,null,null,null,null,null,null,null,null,null,null,null,null,null,null,null,null,null,null,null,null,null,null,null,null,null,null,null,null,null,null,"[PB1] Oncology",null,null,null,null,"Quality control (incl batch safety and potency testing)"]
{"$rows_left_out":66}