{"text_format":"1","workbook":"xlsx","n_sheets":9,"sheets":["STATISTICAL NEIGHBOURS","3-4 year olds ","2 year olds ","Central spend","EY Data","metadata","StatNeighbours - std","Selector-anon","2 YO Revenue funding"],"not_rendered":{"charts":25,"images":0,"macros":1,"external_links":0,"defined_names":39,"comments":1,"pivot_tables":0},"unopened":[],"bounds":{"document_bytes":16777216,"sheet_cells":100000,"rows_first":2000,"rows_last":500,"rows_between":2000,"halvings":0,"cell_chars":16384,"cell_head_chars":4096},"cells_cut":0,"cells_raw":0,"read":"whole","date_system":"1900"}

{"sheet":"STATISTICAL NEIGHBOURS","index":0,"n_rows":25,"n_cols":7,"rows_kept":25,"cut":false,"hidden":false,"merged":[[28,1,34,4],[1,1,1,11],[11,1,11,4],[24,1,26,4],[5,1,5,4],[18,1,18,4],[16,1,16,4]]}
[]
[null,"This worksheet allows you to view data for your own LA along with your statistical neighbours, or with your own choice of other LAs."]
[]
[null,"Choose LAs",null,null,null,null,"Other LAs"]
[]
[null,"1. Please select your LA"]
[]
[null,"My LA"]
[]
[]
[]
[null,"2. Then either select your statistical neighbours:"]
[]
[]
[]
{"$rows_left_out":11}
{"sheet":"3-4 year olds ","index":1,"n_rows":74,"n_cols":11,"rows_kept":74,"cut":false,"hidden":true,"merged":[[75,1,75,10],[71,1,71,10],[1,0,2,9],[4,1,4,2],[18,0,19,9],[22,3,22,4],[25,3,25,5],[25,6,25,8],[26,1,26,2],[72,1,72,10],[74,1,74,10],[46,1,46,9],[6,1,6,2],[73,1,73,10]]}
[]
[{"$f":"CONCATENATE('Selector-anon'!B3,\" - Key Budget Statistics\")","v":{"$error":"#N/A"}},null,null,null,null,null,null,null,null,null,"Financial Year 2013-14"]
[]
[null,null,null,"PVIs","Nursery Schools","Primary Nursery Places","Centrally Retained"]
[null,{"$f":"'Selector-anon'!D3","v":{"$error":"#N/A"}},null,"Private, Voluntary, Independent","Nursery Schools","Primary Nursery Places"]
["Total FTE","Total 3-4 yrs pupils1",null,{"$f":"VLOOKUP('Selector-anon'!$A$3,'EY Data'!$B$5:$AY$162,22,0)","v":{"$error":"#N/A"}},{"$f":"VLOOKUP('Selector-anon'!$A$3,'EY Data'!$B$5:$AY$162,21,0)","v":{"$error":"#N/A"}},{"$f":"VLOOKUP('Selector-anon'!$A$3,'EY Data'!$B$5:$AY$162,20,0)","v":{"$error":"#N/A"}}]
["Total budget","Total 3-4 yrs delegated2",null,{"$f":"VLOOKUP('Selector-anon'!$A$3,'EY Data'!$B$5:$AY$162,metadata!$B$2,0)","v":{"$error":"#N/A"}},{"$f":"VLOOKUP('Selector-anon'!$A$3,'EY Data'!$B$5:$AY$162,metadata!$B$3,0)","v":{"$error":"#N/A"}},{"$f":"VLOOKUP('Selector-anon'!$A$3,'EY Data'!$B$5:$AY$162,metadata!$B$4,0)","v":{"$error":"#N/A"}}]
["Total Hours"]
[]
[]
[]
[]
[]
[]
[]
{"$rows_left_out":60}
{"sheet":"2 year olds ","index":2,"n_rows":74,"n_cols":11,"rows_kept":74,"cut":false,"hidden":true,"merged":[[73,1,73,10],[74,1,74,10],[76,1,76,10],[75,1,75,10],[1,0,2,9],[4,1,4,2],[18,0,19,9],[22,3,22,4],[26,1,26,2],[46,1,46,9],[71,1,71,10],[72,1,72,10],[25,3,25,5],[25,6,25,8],[6,1,6,2]]}
[]
[{"$f":"CONCATENATE('Selector-anon'!B3,\" - Key Budget Statistics\")","v":{"$error":"#N/A"}},null,null,null,null,null,null,null,null,null,"Financial Year 2013-14"]
[]
[null,null,null,"PVIs","Nursery Schools","Primary Nursery Places","Centrally Retained"]
[null,{"$f":"'Selector-anon'!D3","v":{"$error":"#N/A"}},null,"Private, Voluntary, Independent","Nursery Schools","Primary Nursery Places"]
["Total FTE","Total 2yrs pupils1",null,{"$f":"VLOOKUP('Selector-anon'!$A$3,'EY Data'!$B$5:$AY$162,30,0)","v":{"$error":"#N/A"}},{"$f":"VLOOKUP('Selector-anon'!$A$3,'EY Data'!$B$5:$AY$162,29,0)","v":{"$error":"#N/A"}},{"$f":"VLOOKUP('Selector-anon'!$A$3,'EY Data'!$B$5:$AY$162,28,0)","v":{"$error":"#N/A"}}]
["Total budget","Total 2 yrs delegated2",null,{"$f":"VLOOKUP('Selector-anon'!$A$3,'EY Data'!$B$5:$AY$162,metadata!$B$5,0)","v":{"$error":"#N/A"}},{"$f":"VLOOKUP('Selector-anon'!$A$3,'EY Data'!$B$5:$AY$162,metadata!$B$6,0)","v":{"$error":"#N/A"}},{"$f":"VLOOKUP('Selector-anon'!$A$3,'EY Data'!$B$5:$AY$162,metadata!$B$7,0)","v":{"$error":"#N/A"}}]
["Total hours"]
[]
[]
[]
[]
[]
[]
[]
{"$rows_left_out":60}
{"sheet":"Central spend","index":3,"n_rows":73,"n_cols":12,"rows_kept":73,"cut":false,"hidden":true,"merged":[[1,0,2,10],[4,1,4,2],[18,0,19,10],[22,3,22,4],[25,3,25,5],[25,6,25,8],[5,1,5,2],[6,1,6,2],[25,9,26,9],[75,1,75,11],[76,1,76,11],[25,10,26,10],[25,11,26,11],[26,1,26,2],[46,1,46,10],[71,1,71,11],[72,1,72,11],[73,1,73,11],[74,1,74,11]]}
[]
[{"$f":"CONCATENATE('Selector-anon'!B3,\" - Key Budget Statistics\")","v":{"$error":"#N/A"}},null,null,null,null,null,null,null,null,null,null,"Financial Year 2013-14"]
[]
[null,null,null,"PVIs","Nursery Schools","Primary Nursery Places","Centrally Retained"]
[null,{"$f":"'Selector-anon'!D3","v":{"$error":"#N/A"}},null,"Private, Voluntary, Independent","Nursery Schools","Primary Nursery Places"]
["Total 3-4 yrsbudget","Total 3-4 yrs delegated",null,{"$f":"VLOOKUP('Selector-anon'!$A$3,'EY Data'!$B$5:$AY$162,metadata!$B$2,0)","v":{"$error":"#N/A"}},{"$f":"VLOOKUP('Selector-anon'!$A$3,'EY Data'!$B$5:$AY$162,metadata!$B$3,0)","v":{"$error":"#N/A"}},{"$f":"VLOOKUP('Selector-anon'!$A$3,'EY Data'!$B$5:$AY$162,metadata!$B$4,0)","v":{"$error":"#N/A"}}]
["Total 2 yrs budget","Total 2 yrs delegated",null,{"$f":"VLOOKUP('Selector-anon'!$A$3,'EY Data'!$B$5:$AY$162,metadata!$B$5,0)","v":{"$error":"#N/A"}},{"$f":"VLOOKUP('Selector-anon'!$A$3,'EY Data'!$B$5:$AY$162,metadata!$B$6,0)","v":{"$error":"#N/A"}},{"$f":"VLOOKUP('Selector-anon'!$A$3,'EY Data'!$B$5:$AY$162,metadata!$B$7,0)","v":{"$error":"#N/A"}}]
["Total hours"]
[]
[]
[]
[]
[]
[]
[]
{"$rows_left_out":59}
{"sheet":"EY Data","index":4,"n_rows":162,"n_cols":51,"rows_kept":162,"cut":false,"hidden":true,"merged":[[2,45,2,46],[2,48,2,50],[2,4,2,6],[2,8,2,10],[2,36,2,39],[2,41,2,43],[2,12,2,14],[2,16,2,18],[2,20,2,22],[2,24,2,26],[2,28,2,30],[2,32,2,34]]}
[]
[null,1,2,3,4,5,6,7,8,9,10,11,12,13,14,15,16,17,18,19,20,21,22,23,24,25,26,27,28,29,30,31,32,33,34,35,36,37,38,39,40,41,42,43,44,45,46,47,48,49,50]
[null,null,null,null,"3-4 yrs old delegated budget per FE (15 hours) ",null,null,null,"2 yrs old delegated budget per FE (15 hours) ",null,null,null,"3-4 yrs old total delegated budget ",null,null,null,"2 yrs old total delegated budget ",null,null,null,"3-4 yrs old total Pupils",null,null,null,"3-4 yrs old total hours",null,null,null,"2 yrs old total Pupils",null,null,null,"2 yrs old total hours",null,null,null,"Central spend",null,null,null,null,"3-4 yrs old budget per hour",null,null,null,"Central spent and Total budget/H",null,null,"2 yrs old budget per hour"]
[null,"LA","LA name",null,"Nursery Places","Nursery Schools","PVI",null,"Nursery Places","Nursery Schools","PVI",null,"Nursery Places","Nursery Schools","PVI",null,"Nursery Places","Nursery Schools","PVI",null,"Nursery Places","Nursery Schools","PVI",null,"Nursery Places","Nursery Schools","PVI",null,"Nursery Places","Nursery Schools","PVI",null,"Nursery Places","Nursery Schools","PVI",null,"Total delegated for 3-4 yrs old","Total delegated for 2 yrs old","Central spend","percentage of central spend",null,"BUDGET/HOUR - Nursey Places","BUDGET/HOUR - Nursery Schools","BUDGET/HOUR - PVI",null,"BUDGET/HOUR - Centrally Retained","BUDGET/HOUR - TOTAL",null,"BUDGET/HOUR - Nursey Places","BUDGET/HOUR - Nursery Schools","BUDGET/HOUR - PVI"]
[null,301,"Barking and Dagenham",null,2137.2908496732025,"",2331.8700152951974,null,"","",2964,null,6540110,0,3811441.5400000005,null,0,0,3661190,null,3060,0,1634.5,null,1744200,0,931665,null,0,0,1235.219298245614,null,0,0,704075,null,10351551.540000001,3661190,2272558.46,0.13954661320331832,null,3.7496330696021101,"",4.0910000268336804,null,0.67236650946466503,4.8182216252359513,null,"","",5.2]
[null,302,"Barnet",null,2434.7163843991566,4343.4531854838715,2459.5798928183813,null,"","",3420,null,6929202.8300000001,2154352.7800000003,6130679.7999999998,null,0,0,2590200,null,2846,496,2492.5719298245613,null,1622220,282720,1420766,null,0,0,757.36842105263156,null,0,0,431700,null,15214235.41,2590200,0,0,null,4.2714322533318541,7.6200933078664415,4.3150524435410196,null,0,4.7384912383703011,null,"","",6]
[null,370,"Barnsley",null,2315.8407988366193,"",2260.0673260916778,null,"","",2821.5,null,5101557.57,0,2903008.9000000004,null,0,0,2613406.9500000002,null,2202.8964912280703,0,1284.4789473684211,null,1255651,0,732153,null,0,0,926.24736842105267,null,0,0,527961,null,8004566.4700000007,2613406.9500000002,2796731,0.20848249148377432,null,4.0628785944502095,"",3.9650303966520664,null,1.1116821324726276,5.3322565581443424,null,"","",4.95]
[null,800,"Bath and North East Somerset",null,2242.6074531074423,"",2102.3834022110937,null,2850,"",2850,null,728273,0,4247393.5500000007,null,85500,0,900600,null,324.74385964912278,0,2020.2754385964913,null,185104,0,1151557,null,30,0,316,null,17100,0,180120,null,4975666.5500000007,986100,114754,1.8884820524469385E-2,null,3.9343990405393723,"",3.6883919337036732,null,7.4812844021146366E-2,3.9615332284577494,null,5,"",5]
[null,822,"Bedford",null,2097.763514606519,2657.1477988570941,2265.3905735308349,null,2867.1,2867.1,2867.1000456873539,null,1041988.58,867148.53,4495923.9399999995,null,9808.5,83764.59,313773.92,null,496.71403508771931,326.34561403508769,1984.6131578947368,null,283127,186017,1131229.5,null,3.4210526315789473,29.215789473684211,109.43947368421053,null,1950,16653,62380.5,null,6405061.0499999989,407347.01,1735720,0.20305264355152866,null,3.6802868677307354,4.6616628050124449,3.9743694272470789,null,1.0323328121273472,5.0840648714104137,null,5.03,5.0299999999999994,5.0300000801532532]
[null,303,"Bexley",null,2188.6368651154467,"",2200.1681379352995,null,"","",3010.0786259541983,null,3260116.68,0,4493963.08,null,0,0,1577281.2,null,1489.5649122807017,0,2042.5543859649122,null,849052,0,1164256,null,0,0,524,null,0,0,298680,null,7754079.7599999998,1577281.2,1121000,0.10724849670710186,null,3.8397137984481517,"",3.8599441016408762,null,0.48486410829121951,4.5209408353330547,null,"","",5.2808396946564882]
[null,330,"Birmingham",null,3233.5756018998954,5564.1284687672751,2162.3734550482445,null,"","","",null,26518570.530000001,12979208.200000001,19137289.599999998,null,0,0,0,null,8201.0052631578947,2332.6578947368421,8850.1315789473683,null,4674573,1329615,5044575,null,0,0,0,null,0,0,0,null,58635068.329999998,0,19640234,0.25091227265017707,null,5.6729396524559572,9.7616288925741674,3.793637640435517,null,1.7775957362828763,7.0845308501956277,null,"","",""]
[null,889,"Blackburn with Darwen",null,2293.3139268512946,2938.0824119809167,2130.2965665254551,null,"","","",null,2673118.9,978855.66,2601641.5000000005,null,0,0,0,null,1165.6140350877192,333.16140350877191,1221.2578947368422,null,664400,189902,696117,null,0,0,0,null,0,0,0,null,6253616.0600000005,0,2969385,0.32195431624508564,null,4.0233577664057796,5.1545305473349412,3.7373623974130794,null,1.9152145323296477,5.9487151924737764,null,"","",""]
[null,890,"Blackpool",null,2126.1,"",2017.4590746418496,null,"",2764.5,2764.5000000000005,null,1367369.51,41981.67,2940276.71,null,0,546231.25,1235702.4000000001,null,643.13508771929821,0,1457.4157894736843,null,366587,0,830727,null,0,197.58771929824562,446.98947368421051,null,0,112625,254784,null,4349627.8899999997,1781933.6500000001,1132211,0.15587093259943957,null,3.73,"",3.5394018853365785,null,0.72358558032316267,4.6422098607868616,null,"",4.8499999999999996,4.8500000000000005]
[null,350,"Bolton",null,2377.5937508758288,3169.9333142488481,2349.3816245763373,null,"","",2764.4999999999995,null,5027511,1102670.98,5049137,null,0,0,2412773.15,null,2114.5374385964915,347.85305263157892,2149.1344561403507,null,1205286.3400000001,198276.24,1225006.6399999999,null,0,0,872.77017543859654,null,0,0,497479,null,11179318.98,2412773.15,5174808,0.27574122333223067,null,4.1712171067997001,5.5612865162260494,4.121722148379539,null,1.6553832941195004,6.0033943206416698,null,"","",4.8499999999999996]
[null,837,"Bournemouth",null,2391.7126107914787,"",2299.5014297024072,null,"","",2764.5000064507076,null,512703.45999999996,0,5308323.53,null,0,0,1285673.02,null,214.36666666666667,0,2308.4671578947368,null,122189,0,1315826.28,null,0,0,465.06529824561397,null,0,0,265087.21999999997,null,5821026.9900000002,1285673.02,32000,4.4826088720879027E-3,null,4.1959870364762786,"",4.0342130345656271,null,1.8789239050497546E-2,4.1915856561774758,null,"","",4.8500000113170305]
{"$rows_left_out":148}
{"sheet":"metadata","index":5,"n_rows":57,"n_cols":4,"rows_kept":57,"cut":false,"hidden":true,"merged":[]}
["Columns to display","Total","Per pupil","Per hour"]
["3-4 yrs Private, Voluntary, Independent",14,6,43]
["3-4 yrs Nursery Schools",13,5,42]
["3-4 yrs Primary Nursery Places",12,4,41]
["2 yrs Private, Voluntary, Independent",18,10,50]
["2 yrs Nursery Schools",17,9,49]
["2yrs Primary Nursery Places",16,8,48]
["Central spend",38,"N/A","N/A"]
["Delegated as % of central spend",39,"N/A","N/A"]
[]
["3-4 yrs Chart Choice"]
["3-4 yrs per pupil"]
["3-4 yrs per hour"]
[]
["2 yrs Chart Choice"]
{"$rows_left_out":43}
{"sheet":"StatNeighbours - std","index":6,"n_rows":155,"n_cols":23,"rows_kept":155,"cut":false,"hidden":true,"merged":[[0,0,0,11]]}
["This Sheet sent by Andrea Stoker to R Boland.  The table has been modified by removing empty space and LA names.  An autofilter has been added and the list sorted by LA."]
[]
["LA No","Region","Choice","LA No","LA No","LA No","LA No","LA No","LA No","LA No","LA No","LA No","LA No","Proximity","Proximity","Proximity","Proximity","Proximity","Proximity","Proximity","Proximity","Proximity","Proximity"]
[301,"L","Barking and Dagenham",892,333,203,852,810,806,330,335,331,874,"Close","Close","Close","Close","Close","Close","Close","Close","Close","Close"]
[302,"L","Barnet",314,315,312,870,319,313,317,305,318,822,"Close","Close","Close","Close","Close","Close","Close","Somewhat close","Somewhat close","Somewhat close"]
[370,"YH","Barnsley",805,372,807,384,371,394,840,342,861,390,"Very Close","Very Close","Very Close","Very Close","Very Close","Very Close","Very Close","Very Close","Very Close","Very Close"]
[800,"SW","Bath and North East Somerset",916,873,931,938,850,865,802,893,835,845,"Extremely Close","Very Close","Very Close","Very Close","Very Close","Very Close","Very Close","Very Close","Very Close","Very Close"]
[822,"EE","Bedford Borough",826,358,886,919,866,928,319,305,937,356,"Very Close","Very Close","Very Close","Very Close","Very Close","Very Close","Very Close","Very Close","Very Close","Very Close"]
[303,"L","Bexley",311,887,866,881,886,883,882,356,319,938,"Extremely Close","Very Close","Very Close","Very Close","Very Close","Very Close","Very Close","Very Close","Very Close","Very Close"]
[330,"WM","Birmingham",821,333,336,892,301,331,308,380,831,335,"Close","Close","Close","Close","Close","Somewhat close","Somewhat close","Somewhat close","Somewhat close","Somewhat close"]
[889,"NW","Blackburn with Darwen",380,335,331,354,350,353,382,831,874,806,"Very Close","Close","Close","Close","Close","Close","Close","Close","Close","Close"]
[890,"NW","Blackpool",880,357,807,879,805,812,370,921,371,861,"Very Close","Very Close","Very Close","Very Close","Very Close","Very Close","Very Close","Close","Close","Close"]
[350,"NW","Bolton",382,331,381,808,357,831,383,332,342,894,"Very Close","Very Close","Very Close","Very Close","Very Close","Very Close","Very Close","Very Close","Very Close","Very Close"]
[837,"SW","Bournemouth",882,880,921,851,836,845,879,866,878,886,"Very Close","Very Close","Very Close","Very Close","Very Close","Very Close","Very Close","Very Close","Very Close","Very Close"]
[867,"SE","Bracknell Forest",919,823,869,825,850,936,868,895,931,873,"Extremely Close","Very Close","Very Close","Very Close","Very Close","Very Close","Very Close","Very Close","Very Close","Very Close"]
{"$rows_left_out":141}
{"sheet":"Selector-anon","index":7,"n_rows":27,"n_cols":16,"rows_kept":27,"cut":false,"hidden":true,"merged":[]}
["Select LAs to benchmark",null,null,null,1,null,null,null,3,null,null,null,2]
["LA","Name","Symbol","Result","value","order","LA name","LA code","value1","order1","LA name","LA code","value2","order2","LA name","LA code"]
[{"$f":"INDEX('StatNeighbours - std'!A3:A155,MATCH(LAchoice,LAs,0))","v":"LA No"},{"$f":"VLOOKUP('Selector-anon'!A3,'StatNeighbours - std'!$A$4:$C$155,3,0)","v":{"$error":"#N/A"}},null,{"$f":"CONCATENATE(B3,C3)","v":{"$error":"#N/A"}},{"$f":"VLOOKUP(D3,'3-4 year olds '!$B$32:$I$42,$E$1+2,0)","v":{"$error":"#N/A"}},null,{"$f":"INDEX($D$3:$D$13,MATCH(H3,$A$3:$A$13,0))","v":{"$error":"#N/A"}},370,{"$f":"VLOOKUP(D3,'Central spend'!$B$32:$L$42,$I$1+2,0)","v":{"$error":"#N/A"}},null,{"$f":"INDEX($D$3:$D$13,MATCH(L3,$A$3:$A$13,0))","v":{"$error":"#N/A"}},370,{"$f":"VLOOKUP(D3,'2 year olds '!$B$32:$I$42,$M$1+2,0)","v":{"$error":"#N/A"}},null,{"$f":"INDEX($D$3:$D$13,MATCH(P3,$A$3:$A$13,0))","v":{"$error":"#N/A"}},370]
[{"$f":"IF(OR(ISBLANK(D16),D16=1),0,INDEX(OFFSET(LAs,0,-2),D16))","v":0},{"$f":"IF(OR(ISBLANK(D16),D16=1),\"No LA selected\",INDEX(LAs,D16))","v":"No LA selected"},null,{"$f":"CONCATENATE(B4,C4)","v":"No LA selected"},{"$f":"VLOOKUP(D4,'3-4 year olds '!$B$32:$I$42,$E$1+2,0)","v":{"$error":"#N/A"}},null,{"$f":"INDEX($D$3:$D$13,MATCH(H4,$A$3:$A$13,0))","v":{"$error":"#N/A"}},816,{"$f":"VLOOKUP(D4,'Central spend'!$B$32:$L$42,$I$1+2,0)","v":{"$error":"#N/A"}},null,{"$f":"INDEX($D$3:$D$13,MATCH(L4,$A$3:$A$13,0))","v":{"$error":"#N/A"}},816,{"$f":"VLOOKUP(D4,'2 year olds '!$B$32:$I$42,$M$1+2,0)","v":{"$error":"#N/A"}},null,{"$f":"INDEX($D$3:$D$13,MATCH(P4,$A$3:$A$13,0))","v":{"$error":"#N/A"}},816]
[0,"No LA selected",null,{"$f":"CONCATENATE(B5,C5)","v":"No LA selected"},{"$f":"VLOOKUP(D5,'3-4 year olds '!$B$32:$I$42,$E$1+2,0)","v":{"$error":"#N/A"}},null,{"$error":"#N/A"},372,{"$f":"VLOOKUP(D5,'Central spend'!$B$32:$L$42,$I$1+2,0)","v":{"$error":"#N/A"}},null,{"$error":"#N/A"},372,{"$f":"VLOOKUP(D5,'2 year olds '!$B$32:$I$42,$M$1+2,0)","v":{"$error":"#N/A"}},null,{"$error":"#N/A"},372]
[0,"No LA selected",null,"No LA selected",{"$f":"VLOOKUP(D6,'3-4 year olds '!$B$32:$I$42,$E$1+2,0)","v":{"$error":"#N/A"}},null,{"$error":"#N/A"},807,{"$f":"VLOOKUP(D6,'Central spend'!$B$32:$L$42,$I$1+2,0)","v":{"$error":"#N/A"}},null,{"$error":"#N/A"},807,{"$f":"VLOOKUP(D6,'2 year olds '!$B$32:$I$42,$M$1+2,0)","v":{"$error":"#N/A"}},null,{"$error":"#N/A"},807]
[0,"No LA selected",null,"No LA selected",{"$f":"VLOOKUP(D7,'3-4 year olds '!$B$32:$I$42,$E$1+2,0)","v":{"$error":"#N/A"}},null,{"$error":"#N/A"},384,{"$f":"VLOOKUP(D7,'Central spend'!$B$32:$L$42,$I$1+2,0)","v":{"$error":"#N/A"}},null,{"$error":"#N/A"},384,{"$f":"VLOOKUP(D7,'2 year olds '!$B$32:$I$42,$M$1+2,0)","v":{"$error":"#N/A"}},null,{"$error":"#N/A"},384]
[0,"No LA selected",null,"No LA selected",{"$f":"VLOOKUP(D8,'3-4 year olds '!$B$32:$I$42,$E$1+2,0)","v":{"$error":"#N/A"}},null,{"$error":"#N/A"},371,{"$f":"VLOOKUP(D8,'Central spend'!$B$32:$L$42,$I$1+2,0)","v":{"$error":"#N/A"}},null,{"$error":"#N/A"},371,{"$f":"VLOOKUP(D8,'2 year olds '!$B$32:$I$42,$M$1+2,0)","v":{"$error":"#N/A"}},null,{"$error":"#N/A"},371]
[0,"No LA selected",null,"No LA selected",{"$f":"VLOOKUP(D9,'3-4 year olds '!$B$32:$I$42,$E$1+2,0)","v":{"$error":"#N/A"}},null,{"$error":"#N/A"},394,{"$f":"VLOOKUP(D9,'Central spend'!$B$32:$L$42,$I$1+2,0)","v":{"$error":"#N/A"}},null,{"$error":"#N/A"},394,{"$f":"VLOOKUP(D9,'2 year olds '!$B$32:$I$42,$M$1+2,0)","v":{"$error":"#N/A"}},null,{"$error":"#N/A"},394]
[0,"No LA selected",null,"No LA selected",{"$f":"VLOOKUP(D10,'3-4 year olds '!$B$32:$I$42,$E$1+2,0)","v":{"$error":"#N/A"}},null,{"$error":"#N/A"},840,{"$f":"VLOOKUP(D10,'Central spend'!$B$32:$L$42,$I$1+2,0)","v":{"$error":"#N/A"}},null,{"$error":"#N/A"},840,{"$f":"VLOOKUP(D10,'2 year olds '!$B$32:$I$42,$M$1+2,0)","v":{"$error":"#N/A"}},null,{"$error":"#N/A"},840]
[0,"No LA selected",null,"No LA selected",{"$f":"VLOOKUP(D11,'3-4 year olds '!$B$32:$I$42,$E$1+2,0)","v":{"$error":"#N/A"}},null,{"$error":"#N/A"},342,{"$f":"VLOOKUP(D11,'Central spend'!$B$32:$L$42,$I$1+2,0)","v":{"$error":"#N/A"}},null,{"$error":"#N/A"},342,{"$f":"VLOOKUP(D11,'2 year olds '!$B$32:$I$42,$M$1+2,0)","v":{"$error":"#N/A"}},null,{"$error":"#N/A"},342]
[0,"No LA selected",null,"No LA selected",{"$f":"VLOOKUP(D12,'3-4 year olds '!$B$32:$I$42,$E$1+2,0)","v":{"$error":"#N/A"}},null,{"$error":"#N/A"},861,{"$f":"VLOOKUP(D12,'Central spend'!$B$32:$L$42,$I$1+2,0)","v":{"$error":"#N/A"}},null,{"$error":"#N/A"},861,{"$f":"VLOOKUP(D12,'2 year olds '!$B$32:$I$42,$M$1+2,0)","v":{"$error":"#N/A"}},null,{"$error":"#N/A"},861]
[0,"No LA selected",null,"No LA selected",{"$f":"VLOOKUP(D13,'3-4 year olds '!$B$32:$I$42,$E$1+2,0)","v":{"$error":"#N/A"}},null,{"$error":"#N/A"},390,{"$f":"VLOOKUP(D13,'Central spend'!$B$32:$L$42,$I$1+2,0)","v":{"$error":"#N/A"}},null,{"$error":"#N/A"},390,{"$f":"VLOOKUP(D13,'2 year olds '!$B$32:$I$42,$M$1+2,0)","v":{"$error":"#N/A"}},null,{"$error":"#N/A"},390]
[]
["Stat neighbours"]
{"$rows_left_out":13}
{"sheet":"2 YO Revenue funding","index":8,"n_rows":162,"n_cols":11,"rows_kept":162,"cut":false,"hidden":true,"merged":[[164,0,164,5]]}
["2013-14 Revenue Allocations - Funding Early Education for Two Year Olds from Lower Income Households"]
[]
[]
[]
["Region","LA Name","Estimated eligible numbers in January 2013","Statutory Place Funding","Amount per hour","Trajectory Building Allocation",null,"Total revenue",null,"LA Name","Total revenue"]
["North East","Darlington",288.41140407499694,796849.88301144715,4.8471809059733024,312821.70473658934,null,1109671.5877480365,null,"Barking and Dagenham",{"$f":"INDEX($H$6:$H$157,MATCH(J6,$B$6:$B$157,0))","v":4465120.6075018821}]
[null,"Durham",1304.2754216997919,3603573.5845102994,4.8471809059733024,1414665.4920623987,null,5018239.0765726976,null,"Barnet",{"$f":"INDEX($H$6:$H$157,MATCH(J7,$B$6:$B$157,0))","v":4130580.6544374116}]
[null,"Gateshead",509.45451828303646,1407568.3816855156,4.8471809059733024,552573.26389776205,null,1960141.6455832776,null,"Barnsley",2713682.2486346699]
[null,"Hartlepool",342.52056395659235,946347.70838275296,4.8471809059733024,371510.50620861386,null,1317858.2145913667,null,"Bath and North East Somerset",999793.65375653934]
[null,"Middlesbrough",657.90938145937434,1817733.3012522333,4.8471809059733024,713592.91401944438,null,2531326.2152716778,null,"Bedford Borough",1442257.6173040799]
[null,"Newcastle upon Tyne",867.29955139660149,2396255.9604146257,4.8471809059733024,940705.25766940205,null,3336961.218084028,null,"Bexley",2196582.9848996727]
[null,"North Tyneside",486.18261477927467,1343270.5996893358,4.8471809059733015,527331.69430774986,null,1870602.2939970857,null,"Birmingham",18093045.137362953]
[null,"Northumberland",600.92924625311423,1660303.2779190436,4.8471809059733024,651790.14623877569,null,2312093.4241578192,null,"Blackburn with Darwen",1889280.8469717149]
[null,"Redcar and Cleveland",380.87924275631178,1052328.6379928798,4.8471809059733024,413115.75178500317,null,1465444.389777883,null,"Blackpool",1887643.4553799508]
[null,"South Tyneside",440.24762872330933,1216357.1429131597,4.8471809059733024,477508.90491020586,null,1693866.0478233655,null,"Bolton",3359962.4018092062]
{"$rows_left_out":147}